GCC build failure, HEAD@158718 on native

regress regress@apple.com
Mon Apr 26 05:38:00 GMT 2010


With your recent patch, GCC HEAD revision 158718 had problems on:
native: build (about the same as the previous build)
Attached is build output for those targets.
The previous build was of revision 158717.

Log information for changes since the last build:
------------------------------------------------------------------------
r158718 | davek | 2010-04-25 20:41:04 -0700 (Sun, 25 Apr 2010) | 33 lines
Changed paths:
   M /trunk/gcc/lto/ChangeLog
   M /trunk/gcc/lto/lto-elf.c
   M /trunk/gcc/lto/lto-lang.c
   M /trunk/gcc/lto/lto.c
   M /trunk/gcc/lto/lto.h

	* lto.h (lto_elf_file_open): Rename prototype from this ...
	(lto_obj_file_open): ... to this.
	(lto_elf_file_close): Likewise ...
	(lto_obj_file_close): ... and likewise.
	(lto_elf_build_section_table): Likewise ...
	(lto_obj_build_section_table): ... and likewise.
	(lto_elf_begin_section): Likewise ...
	(lto_obj_begin_section): ... and likewise.
	(lto_elf_append_data): Likewise ...
	(lto_obj_append_data): ... and likewise.
	(lto_elf_end_section): Likewise ...
	(lto_obj_end_section): ... and likewise.
	* lto.c (lto_file_read): Update references to the above.
	(lto_wpa_write_files): Likewise.
	(lto_read_all_file_options): Likewise.
	(read_cgraph_and_symbols): Likewise.
	* lto-lang.c (LANG_HOOKS_BEGIN_SECTION): Likewise.
	(LANG_HOOKS_APPEND_DATA): Likewise.
	(LANG_HOOKS_END_SECTION): Likewise.
	* lto-elf.c (lto_elf_file_open): Rename from this ...
	(lto_obj_file_open): ... to this, updating any references.
	(lto_elf_file_close): Likewise ...
	(lto_obj_file_close): ... and likewise.
	(lto_elf_build_section_table): Likewise ...
	(lto_obj_build_section_table): ... and likewise.
	(lto_elf_begin_section): Likewise ...
	(lto_obj_begin_section): ... and likewise.
	(lto_elf_append_data): Likewise ...
	(lto_obj_append_data): ... and likewise.
	(lto_elf_end_section): Likewise ...
	(lto_obj_end_section): ... and likewise.


------------------------------------------------------------------------

For more information, see <http://gcc.gnu.org/regtest/HEAD/>.

-------------- next part --------------
checking for --enable-version-specific-runtime-libs... no
checking for a BSD-compatible install... /usr/bin/install -c
checking for gawk... gawk
checking build system type... powerpc-apple-darwin9.8.0
checking host system type... powerpc-apple-darwin9.8.0
checking for powerpc-apple-darwin9.8.0-ar... ar
checking for powerpc-apple-darwin9.8.0-lipo... lipo
checking for powerpc-apple-darwin9.8.0-nm... /Users/regress/tbox/native/build/./gcc/nm
checking for powerpc-apple-darwin9.8.0-ranlib... ranlib -c
checking for powerpc-apple-darwin9.8.0-strip... strip
checking whether ln -s works... yes
checking for powerpc-apple-darwin9.8.0-gcc... /Users/regress/tbox/native/build/./gcc/xgcc -B/Users/regress/tbox/native/build/./gcc/ -B/Users/regress/tbox/objs/powerpc-apple-darwin9.8.0/bin/ -B/Users/regress/tbox/objs/powerpc-apple-darwin9.8.0/lib/ -isystem /Users/regress/tbox/objs/powerpc-apple-darwin9.8.0/include -isystem /Users/regress/tbox/objs/powerpc-apple-darwin9.8.0/sys-include   
checking for suffix of object files... configure: error: in `/Users/regress/tbox/native/build/powerpc-apple-darwin9.8.0/libgcc':
configure: error: cannot compute suffix of object files: cannot compile
See `config.log' for more details.
make[2]: *** [configure-stage2-target-libgcc] Error 1
make[1]: *** [stage2-bubble] Error 2
make: *** [bootstrap] Error 2
+ '[' -s .bad_compare ']'
+ exit 1
-------------- next part --------------

-- 
Geoffrey Keating <geoffk@apple.com> 
(via an automated GCC regression-testing script.)


More information about the Gcc-regression mailing list