GCC build failure, HEAD@158713 on native

regress regress@apple.com
Mon Apr 26 01:16:00 GMT 2010


With your recent patch, GCC HEAD revision 158713 had problems on:
native: build (about the same as the previous build)
Attached is build output for those targets.
The previous build was of revision 158708.

Log information for changes since the last build:
------------------------------------------------------------------------
r158709 | kargl | 2010-04-25 14:45:21 -0700 (Sun, 25 Apr 2010) | 6 lines
Changed paths:
   M /trunk/gcc/testsuite/ChangeLog
   M /trunk/gcc/testsuite/gfortran.dg/default_format_2.f90
   M /trunk/gcc/testsuite/gfortran.dg/default_format_denormal_1.f90
   M /trunk/gcc/testsuite/gfortran.dg/default_format_denormal_2.f90

2010-04-25  Steven G. Kargl  <kargl@gcc.gnu.org>

   * gfortran.dg/default_format_denormal_2.f90: Remove XFAIL for FreeBSD.
   * gfortran.dg/default_format_denormal_1.f90: ditto
   * gfortran.dg/default_format_2.f90: ditto

------------------------------------------------------------------------
r158710 | hjl | 2010-04-25 14:48:55 -0700 (Sun, 25 Apr 2010) | 7 lines
Changed paths:
   M /trunk/gcc/testsuite/ChangeLog
   M /trunk/gcc/testsuite/gcc.target/i386/pr43766.c

Scan "lea\[lq\]?\[ \t\]" instead of "lea\[ \t\]".

2010-04-25  H.J. Lu  <hongjiu.lu@intel.com>

	* gcc.target/i386/pr43766.c: Scan "lea\[lq\]?\[ \t\]" instead
	of "lea\[ \t\]".

------------------------------------------------------------------------
r158711 | jsm28 | 2010-04-25 14:54:22 -0700 (Sun, 25 Apr 2010) | 32 lines
Changed paths:
   M /trunk/gcc/ChangeLog
   M /trunk/gcc/c-common.c
   M /trunk/gcc/c-common.h
   M /trunk/gcc/c-cppbuiltin.c
   M /trunk/gcc/c-opts.c
   M /trunk/gcc/c.opt
   M /trunk/gcc/doc/cpp.texi
   M /trunk/gcc/doc/cppopts.texi
   M /trunk/gcc/doc/extend.texi
   M /trunk/gcc/doc/invoke.texi
   M /trunk/gcc/doc/standards.texi
   M /trunk/gcc/ginclude/float.h
   M /trunk/gcc/testsuite/ChangeLog
   A /trunk/gcc/testsuite/gcc.dg/c1x-float-1.c
   M /trunk/gcc/testsuite/gcc.dg/c90-float-1.c
   M /trunk/gcc/testsuite/gcc.dg/c99-float-1.c
   M /trunk/libcpp/ChangeLog
   M /trunk/libcpp/include/cpplib.h
   M /trunk/libcpp/init.c

gcc:
	* c-common.c (flag_isoc1x): New.
	(flag_isoc99): Update comment.
	* c-common.h (flag_isoc1x): New.
	(flag_isoc99): Update comment.
	* c-cppbuiltin.c (builtin_define_float_constants): Also define
	__<type>_DECIMAL_DIG__.
	* c-opts.c (set_std_c1x): New.
	(c_common_handle_option): Handle -std=c1x and -std=gnu1x.
	(set_std_c89, set_std_c99): Also set flag_isoc1x to 0.
	* c.opt (-std=c1x, -std=gnu1x): New options.
	* doc/cpp.texi: Mention -std=c1x.
	* doc/cppopts.texi (-std=c1x, -std=gnu1x): Document.
	* doc/extend.texi: Mention -std=c1x and -std=gnu1x.
	* doc/invoke.texi (-std=c1x, -std=gnu1x): Document.
	* doc/standards.texi: Mention C1X.
	* ginclude/float.h (FLT_DECIMAL_DIG, DBL_DECIMAL_DIG,
	LDBL_DECIMAL_DIG, FLT_HAS_SUBNORM, DBL_HAS_SUBNORM,
	LDBL_HAS_SUBNORM, FLT_TRUE_MIN, DBL_TRUE_MIN, LDBL_TRUE_MIN):
	Define for C1X.

gcc/testsuite:
	* gcc.dg/c90-float-1.c: Also test that C1X macros are not defined.
	* gcc.dg/c99-float-1.c: Also test that C1X macros are not defined.
	* gcc.dg/c1x-float-1.c: New test.

libcpp:
	* include/cpplib.h (enum c_lang): Add CLK_GNUC1X and CLK_STDC1X.
	* init.c (lang_defaults): Add entries for new language variants.
	(cpp_init_builtins): Define __STDC_VERSION__ to 201000L for C1X
	variants.

------------------------------------------------------------------------
r158712 | hjl | 2010-04-25 14:58:00 -0700 (Sun, 25 Apr 2010) | 2 lines
Changed paths:
   M /trunk/gcc/testsuite/ChangeLog

Reformat.

------------------------------------------------------------------------
r158713 | redi | 2010-04-25 15:41:49 -0700 (Sun, 25 Apr 2010) | 6 lines
Changed paths:
   M /trunk/libstdc++-v3/ChangeLog
   M /trunk/libstdc++-v3/doc/html/manual/status.html
   M /trunk/libstdc++-v3/doc/xml/manual/status_cxx200x.xml

2010-04-25  Jonathan Wakely  <jwakely.gcc@gmail.com>

	* doc/xml/manual/status_cxx200x.xml: Update Threads status.
	* doc/html/manual/status.html: Regenerate.


------------------------------------------------------------------------

For more information, see <http://gcc.gnu.org/regtest/HEAD/>.

-------------- next part --------------
checking for --enable-version-specific-runtime-libs... no
checking for a BSD-compatible install... /usr/bin/install -c
checking for gawk... gawk
checking build system type... powerpc-apple-darwin9.8.0
checking host system type... powerpc-apple-darwin9.8.0
checking for powerpc-apple-darwin9.8.0-ar... ar
checking for powerpc-apple-darwin9.8.0-lipo... lipo
checking for powerpc-apple-darwin9.8.0-nm... /Users/regress/tbox/native/build/./gcc/nm
checking for powerpc-apple-darwin9.8.0-ranlib... ranlib -c
checking for powerpc-apple-darwin9.8.0-strip... strip
checking whether ln -s works... yes
checking for powerpc-apple-darwin9.8.0-gcc... /Users/regress/tbox/native/build/./gcc/xgcc -B/Users/regress/tbox/native/build/./gcc/ -B/Users/regress/tbox/objs/powerpc-apple-darwin9.8.0/bin/ -B/Users/regress/tbox/objs/powerpc-apple-darwin9.8.0/lib/ -isystem /Users/regress/tbox/objs/powerpc-apple-darwin9.8.0/include -isystem /Users/regress/tbox/objs/powerpc-apple-darwin9.8.0/sys-include   
checking for suffix of object files... configure: error: in `/Users/regress/tbox/native/build/powerpc-apple-darwin9.8.0/libgcc':
configure: error: cannot compute suffix of object files: cannot compile
See `config.log' for more details.
make[2]: *** [configure-stage2-target-libgcc] Error 1
make[1]: *** [stage2-bubble] Error 2
make: *** [bootstrap] Error 2
+ '[' -s .bad_compare ']'
+ exit 1
-------------- next part --------------

-- 
Geoffrey Keating <geoffk@apple.com> 
(via an automated GCC regression-testing script.)


More information about the Gcc-regression mailing list