GCC build failure, HEAD@158708 on native

regress regress@apple.com
Sun Apr 25 23:22:00 GMT 2010


With your recent patch, GCC HEAD revision 158708 had problems on:
native: build (about the same as the previous build)
Attached is build output for those targets.
The previous build was of revision 158706.

Log information for changes since the last build:
------------------------------------------------------------------------
r158708 | kargl | 2010-04-25 14:29:37 -0700 (Sun, 25 Apr 2010) | 38 lines
Changed paths:
   M /trunk/gcc/testsuite/ChangeLog
   M /trunk/gcc/testsuite/gfortran.dg/assignment_2.f90
   M /trunk/gcc/testsuite/gfortran.dg/elemental_args_check_2.f90
   M /trunk/gcc/testsuite/gfortran.dg/graphite/id-18.f90
   M /trunk/gcc/testsuite/gfortran.dg/graphite/id-2.f90
   M /trunk/gcc/testsuite/gfortran.dg/graphite/id-4.f90
   M /trunk/gcc/testsuite/gfortran.dg/graphite/pr37980.f90
   M /trunk/gcc/testsuite/gfortran.dg/graphite/pr38953.f90
   M /trunk/gcc/testsuite/gfortran.dg/graphite/pr40982.f90
   M /trunk/gcc/testsuite/gfortran.dg/graphite/pr41924.f90
   M /trunk/gcc/testsuite/gfortran.dg/graphite/pr42050.f90
   M /trunk/gcc/testsuite/gfortran.dg/graphite/pr42180.f90
   M /trunk/gcc/testsuite/gfortran.dg/graphite/pr42181.f90
   M /trunk/gcc/testsuite/gfortran.dg/graphite/pr42185.f90
   M /trunk/gcc/testsuite/gfortran.dg/graphite/pr42186.f90
   M /trunk/gcc/testsuite/gfortran.dg/graphite/pr42393-1.f90
   M /trunk/gcc/testsuite/gfortran.dg/graphite/pr42393.f90
   M /trunk/gcc/testsuite/gfortran.dg/host_assoc_blockdata_1.f90
   M /trunk/gcc/testsuite/gfortran.dg/host_assoc_blockdata_2.f90
   M /trunk/gcc/testsuite/gfortran.dg/intent_out_3.f90
   M /trunk/gcc/testsuite/gfortran.dg/internal_pack_4.f90
   M /trunk/gcc/testsuite/gfortran.dg/lto/pr40725_0.f03
   M /trunk/gcc/testsuite/gfortran.dg/pr41347.f90
   M /trunk/gcc/testsuite/gfortran.dg/pr41928.f90
   M /trunk/gcc/testsuite/gfortran.dg/pr42166.f90
   M /trunk/gcc/testsuite/gfortran.dg/pr43505.f90
   M /trunk/gcc/testsuite/gfortran.dg/private_type_11.f90
   M /trunk/gcc/testsuite/gfortran.dg/private_type_12.f90
   M /trunk/gcc/testsuite/gfortran.dg/proc_decl_23.f90
   M /trunk/gcc/testsuite/gfortran.dg/recursive_check_3.f90
   M /trunk/gcc/testsuite/gfortran.dg/redefined_intrinsic_assignment.f90
   M /trunk/gcc/testsuite/gfortran.dg/select_type_4.f90
   M /trunk/gcc/testsuite/gfortran.dg/vect/fast-math-real8-pr40801.f90
   M /trunk/gcc/testsuite/gfortran.dg/vect/vect-gems.f90
   M /trunk/gcc/testsuite/gfortran.dg/where_operator_assign_4.f90
   M /trunk/gcc/testsuite/gfortran.dg/whole_file_11.f90

2010-04-25  Steven G. Kargl  <kargl@gcc.gnu.org>
 
	 *gfortran.dg/pr43505.f90: Clean up .mod file.
	 *gfortran.dg/host_assoc_blockdata_1.f90
	 *gfortran.dg/pr41347.f90
	 *gfortran.dg/internal_pack_4.f90
	 *gfortran.dg/proc_decl_23.f90
	 *gfortran.dg/recursive_check_3.f90
	 *gfortran.dg/intent_out_3.f90
	 *gfortran.dg/assignment_2.f90
	 *gfortran.dg/pr41928.f90
	 *gfortran.dg/pr42166.f90
	 *gfortran.dg/private_type_12.f90
	 *gfortran.dg/graphite/pr42185.f90
	 *gfortran.dg/graphite/pr42186.f90
	 *gfortran.dg/graphite/pr40982.f90
	 *gfortran.dg/graphite/id-2.f90
	 *gfortran.dg/graphite/id-4.f90
	 *gfortran.dg/graphite/pr42050.f90
	 *gfortran.dg/graphite/id-18.f90
	 *gfortran.dg/graphite/pr42393-1.f90
	 *gfortran.dg/graphite/pr41924.f90
	 *gfortran.dg/graphite/pr42393.f90
	 *gfortran.dg/graphite/pr37980.f90
	 *gfortran.dg/graphite/pr38953.f90
	 *gfortran.dg/graphite/pr42180.f90
	 *gfortran.dg/graphite/pr42181.f90
	 *gfortran.dg/where_operator_assign_4.f90
	 *gfortran.dg/select_type_4.f90
	 *gfortran.dg/redefined_intrinsic_assignment.f90
	 *gfortran.dg/host_assoc_blockdata_2.f90
	 *gfortran.dg/lto/pr40725_0.f03
	 *gfortran.dg/elemental_args_check_2.f90
	 *gfortran.dg/whole_file_11.f90
	 *gfortran.dg/private_type_11.f90
	 *gfortran.dg/vect/vect-gems.f90
	 *gfortran.dg/vect/fast-math-real8-pr40801.f90

------------------------------------------------------------------------

For more information, see <http://gcc.gnu.org/regtest/HEAD/>.

-------------- next part --------------
checking for --enable-version-specific-runtime-libs... no
checking for a BSD-compatible install... /usr/bin/install -c
checking for gawk... gawk
checking build system type... powerpc-apple-darwin9.8.0
checking host system type... powerpc-apple-darwin9.8.0
checking for powerpc-apple-darwin9.8.0-ar... ar
checking for powerpc-apple-darwin9.8.0-lipo... lipo
checking for powerpc-apple-darwin9.8.0-nm... /Users/regress/tbox/native/build/./gcc/nm
checking for powerpc-apple-darwin9.8.0-ranlib... ranlib -c
checking for powerpc-apple-darwin9.8.0-strip... strip
checking whether ln -s works... yes
checking for powerpc-apple-darwin9.8.0-gcc... /Users/regress/tbox/native/build/./gcc/xgcc -B/Users/regress/tbox/native/build/./gcc/ -B/Users/regress/tbox/objs/powerpc-apple-darwin9.8.0/bin/ -B/Users/regress/tbox/objs/powerpc-apple-darwin9.8.0/lib/ -isystem /Users/regress/tbox/objs/powerpc-apple-darwin9.8.0/include -isystem /Users/regress/tbox/objs/powerpc-apple-darwin9.8.0/sys-include   
checking for suffix of object files... configure: error: in `/Users/regress/tbox/native/build/powerpc-apple-darwin9.8.0/libgcc':
configure: error: cannot compute suffix of object files: cannot compile
See `config.log' for more details.
make[2]: *** [configure-stage2-target-libgcc] Error 1
make[1]: *** [stage2-bubble] Error 2
make: *** [bootstrap] Error 2
+ '[' -s .bad_compare ']'
+ exit 1
-------------- next part --------------

-- 
Geoffrey Keating <geoffk@apple.com> 
(via an automated GCC regression-testing script.)


More information about the Gcc-regression mailing list