GCC build failure, HEAD@158703 on native

regress regress@apple.com
Sun Apr 25 11:44:00 GMT 2010


With your recent patch, GCC HEAD revision 158703 had problems on:
native: build (about the same as the previous build)
Attached is build output for those targets.
The previous build was of revision 158698.

Log information for changes since the last build:
------------------------------------------------------------------------
r158699 | uros | 2010-04-25 01:11:46 -0700 (Sun, 25 Apr 2010) | 11 lines
Changed paths:
   M /trunk/gcc/ChangeLog
   M /trunk/gcc/config/i386/att.h
   M /trunk/gcc/config/i386/gmon-sol2.c
   M /trunk/gcc/config/i386/i386-interix.h
   M /trunk/gcc/config/i386/i386.c
   M /trunk/gcc/config/i386/i386elf.h
   M /trunk/gcc/config/i386/sysv4.h

	* config/i386/gmon-sol2.c (_mcleanup): Change format string
	placeholder from 0x%x to %#x.
	* config/i386/i386elf.h (ASM_OUTPUT_ASCII): Ditto.
	* config/i386/i386-interix.h (ASM_OUTPUT_ASCII): Ditto.
	* config/i386/att.h (ASM_OUTPUT_ASCII): Ditto.
	* config/i386/sysv4.h (ASM_OUTPUT_ASCII): Ditto.
	* config/i386/i386.c (ix86_target_string): Ditto.
	(output_pic_addr_const): Ditto.
	(print_operand): Ditto.


------------------------------------------------------------------------
r158701 | ebotcazou | 2010-04-25 02:22:35 -0700 (Sun, 25 Apr 2010) | 3 lines
Changed paths:
   M /trunk/gcc/ada/ChangeLog
   M /trunk/gcc/ada/gcc-interface/trans.c
   M /trunk/gcc/testsuite/ChangeLog
   A /trunk/gcc/testsuite/gnat.dg/pack15.adb
   A /trunk/gcc/testsuite/gnat.dg/pack15.ads

	* gcc-interface/trans.c (gnat_to_gnu) <N_Assignment_Statement>: Do not
	use memmove if the array type is bit-packed.

------------------------------------------------------------------------
r158703 | ebotcazou | 2010-04-25 02:42:41 -0700 (Sun, 25 Apr 2010) | 6 lines
Changed paths:
   M /trunk/gcc/ada/ChangeLog
   M /trunk/gcc/ada/exp_dbug.ads
   M /trunk/gcc/ada/gcc-interface/decl.c

	* exp_dbug.ads: Fix outdated description.  Mention link between XVS
	and XVZ objects.
	* gcc-interface/decl.c (gnat_to_gnu_entity) <E_Record_Subtype>: Set
	XVZ variable as unit size of XVS type.
	(maybe_pad_type): Likewise.

------------------------------------------------------------------------

For more information, see <http://gcc.gnu.org/regtest/HEAD/>.

-------------- next part --------------
checking for --enable-version-specific-runtime-libs... no
checking for a BSD-compatible install... /usr/bin/install -c
checking for gawk... gawk
checking build system type... powerpc-apple-darwin9.8.0
checking host system type... powerpc-apple-darwin9.8.0
checking for powerpc-apple-darwin9.8.0-ar... ar
checking for powerpc-apple-darwin9.8.0-lipo... lipo
checking for powerpc-apple-darwin9.8.0-nm... /Users/regress/tbox/native/build/./gcc/nm
checking for powerpc-apple-darwin9.8.0-ranlib... ranlib -c
checking for powerpc-apple-darwin9.8.0-strip... strip
checking whether ln -s works... yes
checking for powerpc-apple-darwin9.8.0-gcc... /Users/regress/tbox/native/build/./gcc/xgcc -B/Users/regress/tbox/native/build/./gcc/ -B/Users/regress/tbox/objs/powerpc-apple-darwin9.8.0/bin/ -B/Users/regress/tbox/objs/powerpc-apple-darwin9.8.0/lib/ -isystem /Users/regress/tbox/objs/powerpc-apple-darwin9.8.0/include -isystem /Users/regress/tbox/objs/powerpc-apple-darwin9.8.0/sys-include   
checking for suffix of object files... configure: error: in `/Users/regress/tbox/native/build/powerpc-apple-darwin9.8.0/libgcc':
configure: error: cannot compute suffix of object files: cannot compile
See `config.log' for more details.
make[2]: *** [configure-stage2-target-libgcc] Error 1
make[1]: *** [stage2-bubble] Error 2
make: *** [bootstrap] Error 2
+ '[' -s .bad_compare ']'
+ exit 1
-------------- next part --------------

-- 
Geoffrey Keating <geoffk@apple.com> 
(via an automated GCC regression-testing script.)


More information about the Gcc-regression mailing list