GCC build failure, HEAD@158692 on native

regress regress@apple.com
Sat Apr 24 22:53:00 GMT 2010

With your recent patch, GCC HEAD revision 158692 had problems on:
native: build (about the same as the previous build)
Attached is build output for those targets.
The previous build was of revision 158689.

Log information for changes since the last build:
r158690 | gerald | 2010-04-24 12:34:52 -0700 (Sat, 24 Apr 2010) | 2 lines
Changed paths:
   M /trunk/gcc/ChangeLog
   M /trunk/gcc/doc/contrib.texi

	* doc/contrib.texi (Contributors): Add Dodji Seketeli.

r158692 | kargl | 2010-04-24 13:32:04 -0700 (Sat, 24 Apr 2010) | 13 lines
Changed paths:
   M /trunk/gcc/fortran/ChangeLog
   M /trunk/gcc/fortran/trans-array.c
   M /trunk/gcc/testsuite/ChangeLog
   A /trunk/gcc/testsuite/gfortran.dg/pr43793.f90

2010-04-24  Steven G. Kargl  <kargl@gcc.gnu.org>

        PR fortran/30073
        PR fortran/43793
        * trans-array.c (gfc_trans_array_bound_check): Use TREE_CODE instead
        of mucking with a tree directly.

2010-04-24  Steven G. Kargl  <kargl@gcc.gnu.org>

        PR fortran/30073
        PR fortran/43793
        gfortran.dg/pr43793.f90: New test.


For more information, see <http://gcc.gnu.org/regtest/HEAD/>.

-------------- next part --------------
checking for --enable-version-specific-runtime-libs... no
checking for a BSD-compatible install... /usr/bin/install -c
checking for gawk... gawk
checking build system type... powerpc-apple-darwin9.8.0
checking host system type... powerpc-apple-darwin9.8.0
checking for powerpc-apple-darwin9.8.0-ar... ar
checking for powerpc-apple-darwin9.8.0-lipo... lipo
checking for powerpc-apple-darwin9.8.0-nm... /Users/regress/tbox/native/build/./gcc/nm
checking for powerpc-apple-darwin9.8.0-ranlib... ranlib -c
checking for powerpc-apple-darwin9.8.0-strip... strip
checking whether ln -s works... yes
checking for powerpc-apple-darwin9.8.0-gcc... /Users/regress/tbox/native/build/./gcc/xgcc -B/Users/regress/tbox/native/build/./gcc/ -B/Users/regress/tbox/objs/powerpc-apple-darwin9.8.0/bin/ -B/Users/regress/tbox/objs/powerpc-apple-darwin9.8.0/lib/ -isystem /Users/regress/tbox/objs/powerpc-apple-darwin9.8.0/include -isystem /Users/regress/tbox/objs/powerpc-apple-darwin9.8.0/sys-include   
checking for suffix of object files... configure: error: in `/Users/regress/tbox/native/build/powerpc-apple-darwin9.8.0/libgcc':
configure: error: cannot compute suffix of object files: cannot compile
See `config.log' for more details.
make[2]: *** [configure-stage2-target-libgcc] Error 1
make[1]: *** [stage2-bubble] Error 2
make: *** [bootstrap] Error 2
+ '[' -s .bad_compare ']'
+ exit 1
-------------- next part --------------

Geoffrey Keating <geoffk@apple.com> 
(via an automated GCC regression-testing script.)

More information about the Gcc-regression mailing list