GCC build failure, HEAD@158676 on native

regress regress@apple.com
Fri Apr 23 20:08:00 GMT 2010


With your recent patch, GCC HEAD revision 158676 had problems on:
native: build (about the same as the previous build)
Attached is build output for those targets.
The previous build was of revision 158675.

Log information for changes since the last build:
------------------------------------------------------------------------
r158676 | manu | 2010-04-23 10:14:27 -0700 (Fri, 23 Apr 2010) | 10 lines
Changed paths:
   M /trunk/gcc/ChangeLog
   M /trunk/gcc/common.opt
   M /trunk/gcc/opts.c
   M /trunk/gcc/testsuite/ChangeLog
   M /trunk/gcc/testsuite/gcc.dg/Wconversion-integer.c
   M /trunk/gcc/toplev.c

2010-04-23  Manuel L?\195?\179pez-Ib?\195?\161?\195?\177ez  <manu@gcc.gnu.org>

	* toplev.c (general_init): Set default for
	fdiagnostics-show-option.
	* opts.c (common_handle_option): Allow disabling it.
	* common.opt (fdiagnostics-show-option): Add Var. Enabled by
	default.
testsuite/	
	* gcc.dg/Wconversion-integer.c: Update.

------------------------------------------------------------------------

For more information, see <http://gcc.gnu.org/regtest/HEAD/>.

-------------- next part --------------
checking for --enable-version-specific-runtime-libs... no
checking for a BSD-compatible install... /usr/bin/install -c
checking for gawk... gawk
checking build system type... powerpc-apple-darwin9.8.0
checking host system type... powerpc-apple-darwin9.8.0
checking for powerpc-apple-darwin9.8.0-ar... ar
checking for powerpc-apple-darwin9.8.0-lipo... lipo
checking for powerpc-apple-darwin9.8.0-nm... /Users/regress/tbox/native/build/./gcc/nm
checking for powerpc-apple-darwin9.8.0-ranlib... ranlib -c
checking for powerpc-apple-darwin9.8.0-strip... strip
checking whether ln -s works... yes
checking for powerpc-apple-darwin9.8.0-gcc... /Users/regress/tbox/native/build/./gcc/xgcc -B/Users/regress/tbox/native/build/./gcc/ -B/Users/regress/tbox/objs/powerpc-apple-darwin9.8.0/bin/ -B/Users/regress/tbox/objs/powerpc-apple-darwin9.8.0/lib/ -isystem /Users/regress/tbox/objs/powerpc-apple-darwin9.8.0/include -isystem /Users/regress/tbox/objs/powerpc-apple-darwin9.8.0/sys-include   
checking for suffix of object files... configure: error: in `/Users/regress/tbox/native/build/powerpc-apple-darwin9.8.0/libgcc':
configure: error: cannot compute suffix of object files: cannot compile
See `config.log' for more details.
make[2]: *** [configure-stage2-target-libgcc] Error 1
make[1]: *** [stage2-bubble] Error 2
make: *** [bootstrap] Error 2
+ '[' -s .bad_compare ']'
+ exit 1
-------------- next part --------------

-- 
Geoffrey Keating <geoffk@apple.com> 
(via an automated GCC regression-testing script.)


More information about the Gcc-regression mailing list