GCC build failure, HEAD@158647 on native

regress regress@apple.com
Thu Apr 22 17:56:00 GMT 2010


With your recent patch, GCC HEAD revision 158647 had problems on:
native: build (about the same as the previous build)
Attached is build output for those targets.
The previous build was of revision 158645.

Log information for changes since the last build:
------------------------------------------------------------------------
r158646 | nickc | 2010-04-22 07:28:16 -0700 (Thu, 22 Apr 2010) | 2 lines
Changed paths:
   M /trunk/gcc/ChangeLog
   M /trunk/gcc/config/stormy16/stormy16-lib2.c

        * config/stormy16/stormy16-lib2.c (__ucmpsi2): Fix thinko.

------------------------------------------------------------------------
r158647 | ghazi | 2010-04-22 08:13:51 -0700 (Thu, 22 Apr 2010) | 4 lines
Changed paths:
   M /trunk/gcc/testsuite/ChangeLog
   A /trunk/gcc/testsuite/gcc.dg/cproj-fails-with-broken-glibc.c
   D /trunk/gcc/testsuite/gcc.dg/torture/builtin-cproj-3.c

        * gcc.dg/torture/builtin-cproj-3.c: Rename and move ...
        * gcc.dg/cproj-fails-with-broken-glibc.c: ... to here.


------------------------------------------------------------------------

For more information, see <http://gcc.gnu.org/regtest/HEAD/>.

-------------- next part --------------
checking for --enable-version-specific-runtime-libs... no
checking for a BSD-compatible install... /usr/bin/install -c
checking for gawk... gawk
checking build system type... powerpc-apple-darwin9.8.0
checking host system type... powerpc-apple-darwin9.8.0
checking for powerpc-apple-darwin9.8.0-ar... ar
checking for powerpc-apple-darwin9.8.0-lipo... lipo
checking for powerpc-apple-darwin9.8.0-nm... /Users/regress/tbox/native/build/./gcc/nm
checking for powerpc-apple-darwin9.8.0-ranlib... ranlib -c
checking for powerpc-apple-darwin9.8.0-strip... strip
checking whether ln -s works... yes
checking for powerpc-apple-darwin9.8.0-gcc... /Users/regress/tbox/native/build/./gcc/xgcc -B/Users/regress/tbox/native/build/./gcc/ -B/Users/regress/tbox/objs/powerpc-apple-darwin9.8.0/bin/ -B/Users/regress/tbox/objs/powerpc-apple-darwin9.8.0/lib/ -isystem /Users/regress/tbox/objs/powerpc-apple-darwin9.8.0/include -isystem /Users/regress/tbox/objs/powerpc-apple-darwin9.8.0/sys-include   
checking for suffix of object files... configure: error: in `/Users/regress/tbox/native/build/powerpc-apple-darwin9.8.0/libgcc':
configure: error: cannot compute suffix of object files: cannot compile
See `config.log' for more details.
make[2]: *** [configure-stage2-target-libgcc] Error 1
make[1]: *** [stage2-bubble] Error 2
make: *** [bootstrap] Error 2
+ '[' -s .bad_compare ']'
+ exit 1
-------------- next part --------------

-- 
Geoffrey Keating <geoffk@apple.com> 
(via an automated GCC regression-testing script.)


More information about the Gcc-regression mailing list