GCC build failure, HEAD@158641 on native

regress regress@apple.com
Thu Apr 22 12:14:00 GMT 2010


With your recent patch, GCC HEAD revision 158641 had problems on:
native: build (about the same as the previous build)
Attached is build output for those targets.
The previous build was of revision 158636.

Log information for changes since the last build:
------------------------------------------------------------------------
r158639 | bernds | 2010-04-22 03:42:21 -0700 (Thu, 22 Apr 2010) | 10 lines
Changed paths:
   M /trunk/gcc/ChangeLog
   M /trunk/gcc/df-problems.c
   M /trunk/gcc/df.h
   M /trunk/gcc/ifcvt.c

	* ifcvt.c (dead_or_predicable): Use df_simulate_find_defs and
	df_simulate_find_noclobber_defs as appropriate.  Keep track of an
	extra set merge_set_noclobber, and use it to relax the final test
	slightly.
	* df.h (df_simulate_find_noclobber_defs): Declare.
	* df-problems.c (df_simulate_find_defs): Don't ignore partial or
	conditional defs.
	(df_simulate_find_noclobber_defs): New function.


------------------------------------------------------------------------
r158640 | nickc | 2010-04-22 04:05:12 -0700 (Thu, 22 Apr 2010) | 12 lines
Changed paths:
   M /trunk/gcc/ChangeLog
   A /trunk/gcc/config/stormy16/stormy16-lib2-ucmpsi2.c
   M /trunk/gcc/config/stormy16/stormy16-lib2.c
   M /trunk/gcc/config/stormy16/stormy16.c
   M /trunk/gcc/config/stormy16/stormy16.h
   M /trunk/gcc/config/stormy16/stormy16.md
   M /trunk/gcc/config/stormy16/t-stormy16

        * config/stormy16/stormy16.c
        (xstormy16_asm_output_aligned_common): Handle a NULL decl
        parameter.
        * config/stormy16/stormy16.h: Tidy up formatting.
        (DONT_USE_BUILTIN_SETJMP): Remove definition.
        * config/stormy16/stormy16.c (cbranchsi4): Delete pattern.
        (ineqbranchsi): Delete pattern.
        * config/stormy16/stormy16-lib2-ucmpsi2.c: New file.
        * config/stormy16/stormy16-lib2.c (__ucmpsi2): New function.
        * config/stormy16/t-stormy16 (LIB2FUNCS_EXTRA): Add
        stormy16-lib2-ucmpsi2.c.

------------------------------------------------------------------------
r158641 | rguenth | 2010-04-22 04:19:45 -0700 (Thu, 22 Apr 2010) | 8 lines
Changed paths:
   M /trunk/gcc/ChangeLog
   M /trunk/gcc/testsuite/ChangeLog
   A /trunk/gcc/testsuite/gcc.c-torture/compile/pr43845.c
   M /trunk/gcc/tree-ssa-pre.c

2010-04-22  Richard Guenther  <rguenther@suse.de>

	PR tree-optimization/43845
	* tree-ssa-pre.c (create_component_ref_by_pieces_1): Properly
	lookup the CALL_EXPR function and arguments.

	* gcc.c-torture/compile/pr43845.c: New testcase.

------------------------------------------------------------------------

For more information, see <http://gcc.gnu.org/regtest/HEAD/>.

-------------- next part --------------
/Users/regress/tbox/svn-gcc/gcc/expmed.c:204:3: warning: array subscript is above array bounds
/Users/regress/tbox/svn-gcc/gcc/expmed.c:208:3: warning: array subscript is above array bounds
/Users/regress/tbox/svn-gcc/gcc/expmed.c:212:3: warning: array subscript is above array bounds
/Users/regress/tbox/svn-gcc/gcc/expmed.c:255:8: warning: array subscript is above array bounds
/Users/regress/tbox/svn-gcc/gcc/expmed.c:270:8: warning: array subscript is above array bounds
/Users/regress/tbox/svn-gcc/gcc/expmed.c:271:8: warning: array subscript is above array bounds
/Users/regress/tbox/native/build/./prev-gcc/xgcc -B/Users/regress/tbox/native/build/./prev-gcc/ -B/Users/regress/tbox/objs/powerpc-apple-darwin9.8.0/bin/ -B/Users/regress/tbox/objs/powerpc-apple-darwin9.8.0/bin/ -B/Users/regress/tbox/objs/powerpc-apple-darwin9.8.0/lib/ -isystem /Users/regress/tbox/objs/powerpc-apple-darwin9.8.0/include -isystem /Users/regress/tbox/objs/powerpc-apple-darwin9.8.0/sys-include    -c  -g -O2 -mdynamic-no-pic -gtoggle -DIN_GCC   -W -Wall -Wwrite-strings -Wcast-qual -Wstrict-prototypes -Wmissing-prototypes -Wmissing-format-attribute -pedantic -Wno-long-long -Wno-variadic-macros -Wno-overlength-strings -Werror -Wold-style-definition -Wc++-compat -fno-common  -DHAVE_CONFIG_H -I. -I. -I/Users/regress/tbox/svn-gcc/gcc -I/Users/regress/tbox/svn-gcc/gcc/. -I/Users/regress/tbox/svn-gcc/gcc/../include -I./../intl -I/Users/regress/tbox/svn-gcc/gcc/../libcpp/include  -I/Users/regress/tbox/svn-gcc/gcc/../libdecnumber -I/Users/regress/tbox/svn-gcc/gcc/../libdec
 number/dpd -I../libdecnumber     /Users/regress/tbox/svn-gcc/gcc/expr.c -o expr.o
/Users/regress/tbox/svn-gcc/gcc/expr.c: In function 'expand_expr_real_2':
/Users/regress/tbox/svn-gcc/gcc/expr.c:7720:5: error: implicit declaration of function 'expand_widening_mult'
/Users/regress/tbox/svn-gcc/gcc/expr.c:7720:10: error: assignment makes pointer from integer without a cast
cc1: all warnings being treated as errors

make[3]: *** [expr.o] Error 1
make[3]: *** Waiting for unfinished jobs....
rm gcj-dbtool.pod jcf-dump.pod jv-convert.pod gcj.pod gc-analyze.pod gfdl.pod cpp.pod gij.pod gcc.pod gcov.pod gfortran.pod fsf-funding.pod grmic.pod
make[2]: *** [all-stage2-gcc] Error 2
make[1]: *** [stage2-bubble] Error 2
make: *** [bootstrap] Error 2
+ '[' -s .bad_compare ']'
+ exit 1
-------------- next part --------------

-- 
Geoffrey Keating <geoffk@apple.com> 
(via an automated GCC regression-testing script.)


More information about the Gcc-regression mailing list