GCC build failure, HEAD@158640 on native

GCC regression tester regress@geoffk.org
Thu Apr 22 11:16:00 GMT 2010


With your recent patch, GCC HEAD revision 158640 had problems on:
native: build (about the same as the previous build)
Attached is build output for those targets.
The previous build was of revision 158639.

Log information for changes since the last build:
------------------------------------------------------------------------
r158640 | nickc | 2010-04-22 04:05:12 -0700 (Thu, 22 Apr 2010) | 12 lines
Changed paths:
   M /trunk/gcc/ChangeLog
   A /trunk/gcc/config/stormy16/stormy16-lib2-ucmpsi2.c
   M /trunk/gcc/config/stormy16/stormy16-lib2.c
   M /trunk/gcc/config/stormy16/stormy16.c
   M /trunk/gcc/config/stormy16/stormy16.h
   M /trunk/gcc/config/stormy16/stormy16.md
   M /trunk/gcc/config/stormy16/t-stormy16

        * config/stormy16/stormy16.c
        (xstormy16_asm_output_aligned_common): Handle a NULL decl
        parameter.
        * config/stormy16/stormy16.h: Tidy up formatting.
        (DONT_USE_BUILTIN_SETJMP): Remove definition.
        * config/stormy16/stormy16.c (cbranchsi4): Delete pattern.
        (ineqbranchsi): Delete pattern.
        * config/stormy16/stormy16-lib2-ucmpsi2.c: New file.
        * config/stormy16/stormy16-lib2.c (__ucmpsi2): New function.
        * config/stormy16/t-stormy16 (LIB2FUNCS_EXTRA): Add
        stormy16-lib2-ucmpsi2.c.

------------------------------------------------------------------------

For more information, see <http://glutton.geoffk.org/HEAD/>.

-------------- next part --------------
/home/regress/tbox/svn-gcc/gcc/expmed.c:169:3: warning: array subscript is above array bounds
/home/regress/tbox/svn-gcc/gcc/expmed.c:173:3: warning: array subscript is above array bounds
/home/regress/tbox/svn-gcc/gcc/expmed.c:177:3: warning: array subscript is above array bounds
/home/regress/tbox/svn-gcc/gcc/expmed.c:181:3: warning: array subscript is above array bounds
/home/regress/tbox/svn-gcc/gcc/expmed.c:188:3: warning: array subscript is above array bounds
/home/regress/tbox/svn-gcc/gcc/expmed.c:204:3: warning: array subscript is above array bounds
/home/regress/tbox/svn-gcc/gcc/expmed.c:208:3: warning: array subscript is above array bounds
/home/regress/tbox/svn-gcc/gcc/expmed.c:212:3: warning: array subscript is above array bounds
/home/regress/tbox/svn-gcc/gcc/expmed.c:255:8: warning: array subscript is above array bounds
/home/regress/tbox/svn-gcc/gcc/expmed.c:270:8: warning: array subscript is above array bounds
/home/regress/tbox/svn-gcc/gcc/expmed.c:271:8: warning: array subscript is above array bounds
rm gcj-dbtool.pod jcf-dump.pod jv-convert.pod grmic.pod gcov.pod gcj.pod gc-analyze.pod gfdl.pod cpp.pod gij.pod gfortran.pod fsf-funding.pod gcc.pod
make[3]: Leaving directory `/home/regress/tbox/native/build/gcc'
make[2]: *** [all-stage2-gcc] Error 2
make[2]: Leaving directory `/home/regress/tbox/native/build'
make[1]: *** [stage2-bubble] Error 2
make[1]: Leaving directory `/home/regress/tbox/native/build'
make: *** [bootstrap] Error 2
+ '[' -s .bad_compare ']'
+ exit 1
-------------- next part --------------

-- 
Geoffrey Keating <geoffk@geoffk.org> 
(via an automated GCC regression-testing script.)


More information about the Gcc-regression mailing list