GCC build failure, HEAD@158639 on native

GCC regression tester regress@geoffk.org
Thu Apr 22 10:56:00 GMT 2010


With your recent patch, GCC HEAD revision 158639 had problems on:
native: build (about the same as the previous build)
Attached is build output for those targets.
The previous build was of revision 158636.

Log information for changes since the last build:
------------------------------------------------------------------------
r158639 | bernds | 2010-04-22 03:42:21 -0700 (Thu, 22 Apr 2010) | 10 lines
Changed paths:
   M /trunk/gcc/ChangeLog
   M /trunk/gcc/df-problems.c
   M /trunk/gcc/df.h
   M /trunk/gcc/ifcvt.c

	* ifcvt.c (dead_or_predicable): Use df_simulate_find_defs and
	df_simulate_find_noclobber_defs as appropriate.  Keep track of an
	extra set merge_set_noclobber, and use it to relax the final test
	slightly.
	* df.h (df_simulate_find_noclobber_defs): Declare.
	* df-problems.c (df_simulate_find_defs): Don't ignore partial or
	conditional defs.
	(df_simulate_find_noclobber_defs): New function.


------------------------------------------------------------------------

For more information, see <http://glutton.geoffk.org/HEAD/>.

-------------- next part --------------
/home/regress/tbox/svn-gcc/gcc/expmed.c:169:3: warning: array subscript is above array bounds
/home/regress/tbox/svn-gcc/gcc/expmed.c:173:3: warning: array subscript is above array bounds
/home/regress/tbox/svn-gcc/gcc/expmed.c:177:3: warning: array subscript is above array bounds
/home/regress/tbox/svn-gcc/gcc/expmed.c:181:3: warning: array subscript is above array bounds
/home/regress/tbox/svn-gcc/gcc/expmed.c:188:3: warning: array subscript is above array bounds
/home/regress/tbox/svn-gcc/gcc/expmed.c:204:3: warning: array subscript is above array bounds
/home/regress/tbox/svn-gcc/gcc/expmed.c:208:3: warning: array subscript is above array bounds
/home/regress/tbox/svn-gcc/gcc/expmed.c:212:3: warning: array subscript is above array bounds
/home/regress/tbox/svn-gcc/gcc/expmed.c:255:8: warning: array subscript is above array bounds
/home/regress/tbox/svn-gcc/gcc/expmed.c:270:8: warning: array subscript is above array bounds
/home/regress/tbox/svn-gcc/gcc/expmed.c:271:8: warning: array subscript is above array bounds
rm gcj-dbtool.pod jcf-dump.pod jv-convert.pod grmic.pod gcov.pod gcj.pod gc-analyze.pod gfdl.pod cpp.pod gij.pod gfortran.pod fsf-funding.pod gcc.pod
make[3]: Leaving directory `/home/regress/tbox/native/build/gcc'
make[2]: *** [all-stage2-gcc] Error 2
make[2]: Leaving directory `/home/regress/tbox/native/build'
make[1]: *** [stage2-bubble] Error 2
make[1]: Leaving directory `/home/regress/tbox/native/build'
make: *** [bootstrap] Error 2
+ '[' -s .bad_compare ']'
+ exit 1
-------------- next part --------------

-- 
Geoffrey Keating <geoffk@geoffk.org> 
(via an automated GCC regression-testing script.)


More information about the Gcc-regression mailing list