NEW GCC build failure, HEAD@158438 on native

GCC regression tester regress@geoffk.org
Fri Apr 16 18:12:00 GMT 2010


With your recent patch, GCC HEAD revision 158438 had problems on:
native: build (NEW build failure)
Attached is build output for those targets.
The previous build was of revision 158436.

Log information for changes since the last build:
------------------------------------------------------------------------
r158437 | aesok | 2010-04-16 10:31:00 -0700 (Fri, 16 Apr 2010) | 4 lines
Changed paths:
   M /trunk/gcc/ChangeLog
   M /trunk/gcc/double-int.c
   M /trunk/gcc/double-int.h

	* double-int.h (tree_to_double_int): Convert to macro.
	* double-int.c (tree_to_double_int): Remove.


------------------------------------------------------------------------
r158438 | uros | 2010-04-16 10:58:12 -0700 (Fri, 16 Apr 2010) | 7 lines
Changed paths:
   M /trunk/gcc/ChangeLog
   M /trunk/gcc/config/i386/i386.md

	* config/i386/i386.md (*bt<mode>): Macroize insn from *btsi and
	*btdi_rex64 using SWI48 mode iterator.
	(*jcc_bt<mode>): Ditto from *jcc_btsi and *jcc_btdi_rex64.
	(*jcc_bt<mode>_mask): Ditto from *jcc_btsi_mask and
	*jcc_btdi_mask_rex64.


------------------------------------------------------------------------

For more information, see <http://glutton.geoffk.org/HEAD/>.

-------------- next part --------------
	    build/genoutput.o build/rtl.o build/read-rtl.o build/ggc-none.o build/vec.o build/min-insn-modes.o build/gensupport.o build/print-rtl.o build/errors.o ../build-i686-pc-linux-gnu/libiberty/libiberty.a
gcc  -g -fkeep-inline-functions -DIN_GCC   -W -Wall -Wwrite-strings -Wcast-qual -Wstrict-prototypes -Wmissing-prototypes -Wmissing-format-attribute -Wold-style-definition -Wc++-compat -fno-common  -DHAVE_CONFIG_H -DGENERATOR_FILE  -o build/genpeep \
	    build/genpeep.o build/rtl.o build/read-rtl.o build/ggc-none.o build/vec.o build/min-insn-modes.o build/gensupport.o build/print-rtl.o build/errors.o ../build-i686-pc-linux-gnu/libiberty/libiberty.a
gcc  -g -fkeep-inline-functions -DIN_GCC   -W -Wall -Wwrite-strings -Wcast-qual -Wstrict-prototypes -Wmissing-prototypes -Wmissing-format-attribute -Wold-style-definition -Wc++-compat -fno-common  -DHAVE_CONFIG_H -DGENERATOR_FILE  -o build/genrecog \
	    build/genrecog.o build/rtl.o build/read-rtl.o build/ggc-none.o build/vec.o build/min-insn-modes.o build/gensupport.o build/print-rtl.o build/errors.o ../build-i686-pc-linux-gnu/libiberty/libiberty.a
build/genmddeps /home/regress/tbox/svn-gcc/gcc/config/i386/i386.md > tmp-mddeps
gcc  -g -fkeep-inline-functions -DIN_GCC   -W -Wall -Wwrite-strings -Wcast-qual -Wstrict-prototypes -Wmissing-prototypes -Wmissing-format-attribute -Wold-style-definition -Wc++-compat -fno-common  -DHAVE_CONFIG_H -DGENERATOR_FILE  -o build/genattrtab \
	    build/genattrtab.o build/rtl.o build/read-rtl.o build/ggc-none.o build/vec.o build/min-insn-modes.o build/gensupport.o build/print-rtl.o build/errors.o ../build-i686-pc-linux-gnu/libiberty/libiberty.a
/home/regress/tbox/svn-gcc/gcc/config/i386/i386.md:11276: expected character `(', found `d'
/home/regress/tbox/svn-gcc/gcc/config/i386/i386.md:11276: following context is `efine_insn_and_split "*jcc_bt<mode>_mask"'
make[3]: *** [s-mddeps] Error 1
rm gcov.pod gfdl.pod cpp.pod fsf-funding.pod gcc.pod
make[3]: Leaving directory `/home/regress/tbox/native/build/gcc'
make[2]: *** [all-stage1-gcc] Error 2
make[2]: Leaving directory `/home/regress/tbox/native/build'
make[1]: *** [stage1-bubble] Error 2
make[1]: Leaving directory `/home/regress/tbox/native/build'
make: *** [bootstrap] Error 2
+ '[' -s .bad_compare ']'
+ exit 1
-------------- next part --------------

-- 
Geoffrey Keating <geoffk@geoffk.org> 
(via an automated GCC regression-testing script.)


More information about the Gcc-regression mailing list