GCC build failure, HEAD@158219 on native

GCC regression tester regress@geoffk.org
Mon Apr 12 10:07:00 GMT 2010


With your recent patch, GCC HEAD revision 158219 had problems on:
native: build (about the same as the previous build)
Attached is build output for those targets.
The previous build was of revision 158218.

Log information for changes since the last build:
------------------------------------------------------------------------
r158219 | ebotcazou | 2010-04-12 03:00:13 -0700 (Mon, 12 Apr 2010) | 6 lines
Changed paths:
   M /trunk/gcc/ChangeLog
   M /trunk/gcc/expr.c
   M /trunk/gcc/gimplify.c
   M /trunk/gcc/testsuite/ChangeLog
   A /trunk/gcc/testsuite/gnat.dg/aggr13.adb
   A /trunk/gcc/testsuite/gnat.dg/aggr14.adb
   A /trunk/gcc/testsuite/gnat.dg/aggr14_pkg.adb
   A /trunk/gcc/testsuite/gnat.dg/aggr14_pkg.ads

	* expr.c (categorize_ctor_elements_1): Properly count sub-elements of
	non-constant aggregate elements.

	* gimplify.c (gimplify_init_constructor): Do not pre-evaluate if this
	is a real initialization.

------------------------------------------------------------------------

For more information, see <http://glutton.geoffk.org/HEAD/>.

-------------- next part --------------
		-I. -I. -I/home/regress/tbox/svn-gcc/gcc -I/home/regress/tbox/svn-gcc/gcc/. -I/home/regress/tbox/svn-gcc/gcc/../include -I/home/regress/tbox/svn-gcc/gcc/../libcpp/include  -I/home/regress/tbox/svn-gcc/gcc/../libdecnumber -I/home/regress/tbox/svn-gcc/gcc/../libdecnumber/bid -I../libdecnumber    /home/regress/tbox/svn-gcc/gcc/cp/g++spec.c)
/home/regress/tbox/svn-gcc/gcc/lto-wrapper.c: In function 'collect_wait':
/home/regress/tbox/svn-gcc/gcc/lto-wrapper.c:180:11: error: variable '__u' set but not used
/home/regress/tbox/svn-gcc/gcc/lto-wrapper.c:182:14: error: variable '__u' set but not used
/home/regress/tbox/svn-gcc/gcc/lto-wrapper.c:183:8: error: variable '__u' set but not used
/home/regress/tbox/svn-gcc/gcc/lto-wrapper.c:191:11: error: variable '__u' set but not used
/home/regress/tbox/svn-gcc/gcc/lto-wrapper.c:192:45: error: variable '__u' set but not used
cc1: all warnings being treated as errors

make[3]: *** [lto-wrapper.o] Error 1
make[3]: *** Waiting for unfinished jobs....
rm gcj-dbtool.pod jcf-dump.pod jv-convert.pod grmic.pod gcov.pod gcj.pod gc-analyze.pod gfdl.pod cpp.pod gij.pod gfortran.pod fsf-funding.pod gcc.pod
make[3]: Leaving directory `/home/regress/tbox/native/build/gcc'
make[2]: *** [all-stage2-gcc] Error 2
make[2]: Leaving directory `/home/regress/tbox/native/build'
make[1]: *** [stage2-bubble] Error 2
make[1]: Leaving directory `/home/regress/tbox/native/build'
make: *** [bootstrap] Error 2
+ '[' -s .bad_compare ']'
+ exit 1
-------------- next part --------------

-- 
Geoffrey Keating <geoffk@geoffk.org> 
(via an automated GCC regression-testing script.)


More information about the Gcc-regression mailing list