GCC build failure, HEAD@158205 on native

GCC regression tester regress@geoffk.org
Sun Apr 11 20:54:00 GMT 2010


With your recent patch, GCC HEAD revision 158205 had problems on:
native: build (about the same as the previous build)
Attached is build output for those targets.
The previous build was of revision 158204.

Log information for changes since the last build:
------------------------------------------------------------------------
r158205 | uros | 2010-04-11 13:40:02 -0700 (Sun, 11 Apr 2010) | 24 lines
Changed paths:
   M /trunk/gcc/ChangeLog
   M /trunk/gcc/config/i386/i386.md

	* config/i386/i386.md (any_shiftrt): New code iterator.
	(shiftrt_insn): New code attribute.
	(shiftrt): Ditto.
	(<shiftrt_insn><mode>3): Macroize expander from ashr<mode>3 and
	lshr<mode>3 using any_shiftrt code iterator.
	(*<shiftrt_insn><mode>3_doubleword): Macroize insn_and_split from
	*ashr<mode>3_doubleword and *lshr<mode>3_doubleword using
	any_shiftrt code iterator.
	(*<shiftrt_insn><mode>3_doubleword peephole2): Macroize peephole2
	pattern from corresponding peephole2 patterns.
	(*<shiftrt_insn><mode>3_1): Macroize insn from *ashr<mode>3_1
	and *lshr<mode>3_1 using any_shiftrt code iterator.
	(*<shiftrt_insn>si3_1_zext): Ditto from *ashrsi3_1_zext
	and *lshrsi3_1_zext.
	(*<shiftrt_insn>qi3_1_slp): Ditto from *ashrqi3_1_slp
	and *lshrqi3_1_slp.
	(*<shiftrt_insn><mode>3_cmp): Ditto from *ashr<mode>3_cmp
	and *lshr<mode>3_cmp.
	(*<shiftrt_insn><mode>3_cmp_zext): Ditto from *ashr<mode>3_cmp_zext
	and *lshr<mode>3_cmp_zext.
	(*<shiftrt_insn><mode>3_cconly): Ditto from *ashr<mode>3_cconly
	and *lshr<mode>3_cconly.


------------------------------------------------------------------------

For more information, see <http://glutton.geoffk.org/HEAD/>.

-------------- next part --------------
		-I. -I. -I/home/regress/tbox/svn-gcc/gcc -I/home/regress/tbox/svn-gcc/gcc/. -I/home/regress/tbox/svn-gcc/gcc/../include -I/home/regress/tbox/svn-gcc/gcc/../libcpp/include  -I/home/regress/tbox/svn-gcc/gcc/../libdecnumber -I/home/regress/tbox/svn-gcc/gcc/../libdecnumber/bid -I../libdecnumber    /home/regress/tbox/svn-gcc/gcc/cp/g++spec.c)
/home/regress/tbox/svn-gcc/gcc/lto-wrapper.c: In function 'collect_wait':
/home/regress/tbox/svn-gcc/gcc/lto-wrapper.c:180:11: error: variable '__u' set but not used
/home/regress/tbox/svn-gcc/gcc/lto-wrapper.c:182:14: error: variable '__u' set but not used
/home/regress/tbox/svn-gcc/gcc/lto-wrapper.c:183:8: error: variable '__u' set but not used
/home/regress/tbox/svn-gcc/gcc/lto-wrapper.c:191:11: error: variable '__u' set but not used
/home/regress/tbox/svn-gcc/gcc/lto-wrapper.c:192:45: error: variable '__u' set but not used
cc1: all warnings being treated as errors

make[3]: *** [lto-wrapper.o] Error 1
make[3]: *** Waiting for unfinished jobs....
rm gcj-dbtool.pod jcf-dump.pod jv-convert.pod grmic.pod gcov.pod gcj.pod gc-analyze.pod gfdl.pod cpp.pod gij.pod gfortran.pod fsf-funding.pod gcc.pod
make[3]: Leaving directory `/home/regress/tbox/native/build/gcc'
make[2]: *** [all-stage2-gcc] Error 2
make[2]: Leaving directory `/home/regress/tbox/native/build'
make[1]: *** [stage2-bubble] Error 2
make[1]: Leaving directory `/home/regress/tbox/native/build'
make: *** [bootstrap] Error 2
+ '[' -s .bad_compare ']'
+ exit 1
-------------- next part --------------

-- 
Geoffrey Keating <geoffk@geoffk.org> 
(via an automated GCC regression-testing script.)


More information about the Gcc-regression mailing list