GCC build failure, HEAD@158173 on native

GCC regression tester regress@geoffk.org
Fri Apr 9 17:43:00 GMT 2010


With your recent patch, GCC HEAD revision 158173 had problems on:
native: build (about the same as the previous build)
Attached is build output for those targets.
The previous build was of revision 158171.

Log information for changes since the last build:
------------------------------------------------------------------------
r158172 | ro | 2010-04-09 10:32:54 -0700 (Fri, 09 Apr 2010) | 7 lines
Changed paths:
   M /trunk/gcc/ChangeLog
   M /trunk/gcc/configure
   M /trunk/gcc/configure.ac
   M /trunk/gcc/doc/install.texi

	* configure.ac: Determine Sun ld version numbers.
	(comdat_group): Restrict GNU ld version checks to gld.
	(comdat_group, *-*-solaris2.1[1-9]*): Enable for Sun ld > 1.1688.
	(enable_comdat): Support --enable-comdat.
	* configure: Regenerate.
	* doc/install.texi (Configuration): Document --enable-comdat.

------------------------------------------------------------------------
r158173 | ro | 2010-04-09 10:35:18 -0700 (Fri, 09 Apr 2010) | 6 lines
Changed paths:
   M /trunk/gcc/ChangeLog
   M /trunk/gcc/config/sol2-gld.h
   M /trunk/gcc/config/sol2.h
   M /trunk/gcc/configure
   M /trunk/gcc/configure.ac

	* configure.ac (plugin -rdynamic test): Log result.
	* configure: Regenerate.
	* config/sol2.h (LINK_SPEC): Handle -rdynamic.
	(RDYNAMIC_SPEC): Define.
	* config/sol2-gld.h (RDYNAMIC_SPEC): Redefine.

------------------------------------------------------------------------

For more information, see <http://glutton.geoffk.org/HEAD/>.

-------------- next part --------------
		-I. -I. -I/home/regress/tbox/svn-gcc/gcc -I/home/regress/tbox/svn-gcc/gcc/. -I/home/regress/tbox/svn-gcc/gcc/../include -I/home/regress/tbox/svn-gcc/gcc/../libcpp/include  -I/home/regress/tbox/svn-gcc/gcc/../libdecnumber -I/home/regress/tbox/svn-gcc/gcc/../libdecnumber/bid -I../libdecnumber    /home/regress/tbox/svn-gcc/gcc/cp/g++spec.c)
/home/regress/tbox/svn-gcc/gcc/lto-wrapper.c: In function 'collect_wait':
/home/regress/tbox/svn-gcc/gcc/lto-wrapper.c:180:11: error: variable '__u' set but not used
/home/regress/tbox/svn-gcc/gcc/lto-wrapper.c:182:14: error: variable '__u' set but not used
/home/regress/tbox/svn-gcc/gcc/lto-wrapper.c:183:8: error: variable '__u' set but not used
/home/regress/tbox/svn-gcc/gcc/lto-wrapper.c:191:11: error: variable '__u' set but not used
/home/regress/tbox/svn-gcc/gcc/lto-wrapper.c:192:45: error: variable '__u' set but not used
cc1: all warnings being treated as errors

make[3]: *** [lto-wrapper.o] Error 1
make[3]: *** Waiting for unfinished jobs....
rm gcj-dbtool.pod jcf-dump.pod jv-convert.pod grmic.pod gcov.pod gcj.pod gc-analyze.pod gfdl.pod cpp.pod gij.pod gfortran.pod fsf-funding.pod gcc.pod
make[3]: Leaving directory `/home/regress/tbox/native/build/gcc'
make[2]: *** [all-stage2-gcc] Error 2
make[2]: Leaving directory `/home/regress/tbox/native/build'
make[1]: *** [stage2-bubble] Error 2
make[1]: Leaving directory `/home/regress/tbox/native/build'
make: *** [bootstrap] Error 2
+ '[' -s .bad_compare ']'
+ exit 1
-------------- next part --------------

-- 
Geoffrey Keating <geoffk@geoffk.org> 
(via an automated GCC regression-testing script.)


More information about the Gcc-regression mailing list