GCC build failure, HEAD@145377 on native

regress regress@apple.com
Tue Mar 31 23:09:00 GMT 2009


With your recent patch, GCC HEAD revision 145377 had problems on:
native: build (about the same as the previous build)
Attached is build output for those targets.
The previous build was of revision 145376.

Log information for changes since the last build:
------------------------------------------------------------------------
r145377 | hjl | 2009-03-31 15:31:42 -0700 (Tue, 31 Mar 2009) | 4 lines
Changed paths:
   M /trunk/gcc/testsuite/ChangeLog
   D /trunk/gcc/testsuite/gcc.c-torture/compile/pr33009.c

2009-03-31  H.J. Lu  <hongjiu.lu@intel.com>

	* gcc.c-torture/compile/pr33009.c: Removed.

------------------------------------------------------------------------

For more information, see <http://gcc.gnu.org/regtest/HEAD/>.

-------------- next part --------------
/Users/regress/tbox/svn-gcc/gcc/c-common.c:5002: error: null argument where non-null required (argument 1)
/Users/regress/tbox/svn-gcc/gcc/c-common.c:5002: error: null argument where non-null required (argument 1)
/Users/regress/tbox/svn-gcc/gcc/c-common.c:5005: error: null argument where non-null required (argument 1)
/Users/regress/tbox/svn-gcc/gcc/c-common.c:5005: error: null argument where non-null required (argument 1)
/Users/regress/tbox/svn-gcc/gcc/c-common.c:5008: error: null argument where non-null required (argument 1)
/Users/regress/tbox/svn-gcc/gcc/c-common.c:5008: error: null argument where non-null required (argument 1)
/Users/regress/tbox/svn-gcc/gcc/c-common.c:5011: error: null argument where non-null required (argument 1)
/Users/regress/tbox/svn-gcc/gcc/c-common.c:5011: error: null argument where non-null required (argument 1)
/Users/regress/tbox/svn-gcc/gcc/c-common.c:5014: error: null argument where non-null required (argument 1)
/Users/regress/tbox/svn-gcc/gcc/c-common.c:5014: error: null argument where non-null required (argument 1)
/Users/regress/tbox/svn-gcc/gcc/c-common.c:5017: error: null argument where non-null required (argument 1)
/Users/regress/tbox/svn-gcc/gcc/c-common.c:5017: error: null argument where non-null required (argument 1)
make[3]: *** [c-common.o] Error 1
make[3]: *** Waiting for unfinished jobs....
rm gcj-dbtool.pod gcov.pod fsf-funding.pod jcf-dump.pod jv-convert.pod gcj.pod gc-analyze.pod gfdl.pod cpp.pod gij.pod grmic.pod gcc.pod gfortran.pod
make[2]: *** [all-stage2-gcc] Error 2
make[1]: *** [stage2-bubble] Error 2
make: *** [bootstrap] Error 2
+ '[' -s .bad_compare ']'
+ exit 1
-------------- next part --------------

-- 
Geoffrey Keating <geoffk@apple.com> 
(via an automated GCC regression-testing script.)


More information about the Gcc-regression mailing list