GCC build failure, HEAD@155229 on native

GCC regression tester regress@geoffk.org
Mon Dec 14 18:31:00 GMT 2009


With your recent patch, GCC HEAD revision 155229 had problems on:
native: build (about the same as the previous build)
Attached is build output for those targets.
The previous build was of revision 155225.

Log information for changes since the last build:
------------------------------------------------------------------------
r155229 | ebotcazou | 2009-12-14 10:27:58 -0800 (Mon, 14 Dec 2009) | 4 lines
Changed paths:
   M /trunk/gcc/ChangeLog
   M /trunk/gcc/cfgexpand.c

	* cfgexpand.c (expand_debug_expr) <INDIRECT_REF>: Remove overzealous
	assertion and useless code.
	<TARGET_MEM_REF>: Likewise.

------------------------------------------------------------------------

For more information, see <http://glutton.geoffk.org/HEAD/>.

-------------- next part --------------
/home/regress/tbox/svn-gcc/gcc/config/i386/i386.c:25967: warning: unknown conversion type character 'E' in format
/home/regress/tbox/svn-gcc/gcc/config/i386/i386.c:25967: warning: too many arguments for format
/home/regress/tbox/svn-gcc/gcc/config/i386/i386.c: In function 'ix86_handle_fndecl_attribute':
/home/regress/tbox/svn-gcc/gcc/config/i386/i386.c:25982: warning: unknown conversion type character 'E' in format
/home/regress/tbox/svn-gcc/gcc/config/i386/i386.c:25982: warning: too many arguments for format
/home/regress/tbox/svn-gcc/gcc/config/i386/i386.c:25990: warning: unknown conversion type character 'E' in format
/home/regress/tbox/svn-gcc/gcc/config/i386/i386.c:25990: warning: too many arguments for format
make[3]: *** [i386.o] Error 1
make[3]: *** Waiting for unfinished jobs....
/bin/sh /home/regress/tbox/svn-gcc/gcc/../move-if-change tmp-attrtab.c insn-attrtab.c
echo timestamp > s-attrtab
rm gcov.pod gfdl.pod cpp.pod gcc.pod fsf-funding.pod
make[3]: Leaving directory `/home/regress/tbox/native/build/gcc'
make[2]: *** [all-stage1-gcc] Error 2
make[2]: Leaving directory `/home/regress/tbox/native/build'
make[1]: *** [stage1-bubble] Error 2
make[1]: Leaving directory `/home/regress/tbox/native/build'
make: *** [bootstrap] Error 2
+ '[' -s .bad_compare ']'
+ exit 1
-------------- next part --------------

-- 
Geoffrey Keating <geoffk@geoffk.org> 
(via an automated GCC regression-testing script.)


More information about the Gcc-regression mailing list