GCC build failure, HEAD@146997 on native

regress regress@apple.com
Thu Apr 30 07:12:00 GMT 2009


With your recent patch, GCC HEAD revision 146997 had problems on:
native: build (seems to have stopped earlier)
Attached is build output for those targets.
The previous build was of revision 146995.

Log information for changes since the last build:
------------------------------------------------------------------------
r146997 | krebbel | 2009-04-29 23:54:54 -0700 (Wed, 29 Apr 2009) | 5 lines
Changed paths:
   M /trunk/gcc/ChangeLog
   M /trunk/gcc/gcse.c

2009-04-30  Andreas Krebbel  <krebbel1@de.ibm.com>

	* gcse.c (gcse_constant_p): Make sure the constant is sharable.


------------------------------------------------------------------------

For more information, see <http://gcc.gnu.org/regtest/HEAD/>.

-------------- next part --------------
gcc -c  -g -fkeep-inline-functions -DIN_GCC   -W -Wall -Wwrite-strings -Wstrict-prototypes -Wmissing-prototypes -Wcast-qual -Wold-style-definition -Wc++-compat -Wmissing-format-attribute -pedantic -Wno-long-long -Wno-variadic-macros -Wno-overlength-strings -fno-common  -DHAVE_CONFIG_H -I. -I. -I/Users/regress/tbox/svn-gcc/gcc -I/Users/regress/tbox/svn-gcc/gcc/. -I/Users/regress/tbox/svn-gcc/gcc/../include -I./../intl -I/Users/regress/tbox/svn-gcc/gcc/../libcpp/include  -I/Users/regress/tbox/svn-gcc/gcc/../libdecnumber -I/Users/regress/tbox/svn-gcc/gcc/../libdecnumber/dpd -I../libdecnumber    /Users/regress/tbox/svn-gcc/gcc/fixed-value.c -o fixed-value.o
gcc -c  -g -fkeep-inline-functions -DIN_GCC   -W -Wall -Wwrite-strings -Wstrict-prototypes -Wmissing-prototypes -Wcast-qual -Wold-style-definition -Wc++-compat -Wmissing-format-attribute -pedantic -Wno-long-long -Wno-variadic-macros -Wno-overlength-strings -fno-common  -DHAVE_CONFIG_H -I. -I. -I/Users/regress/tbox/svn-gcc/gcc -I/Users/regress/tbox/svn-gcc/gcc/. -I/Users/regress/tbox/svn-gcc/gcc/../include -I./../intl -I/Users/regress/tbox/svn-gcc/gcc/../libcpp/include  -I/Users/regress/tbox/svn-gcc/gcc/../libdecnumber -I/Users/regress/tbox/svn-gcc/gcc/../libdecnumber/dpd -I../libdecnumber    /Users/regress/tbox/svn-gcc/gcc/fold-const.c -o fold-const.o
gcc -c  -g -fkeep-inline-functions -DIN_GCC   -W -Wall -Wwrite-strings -Wstrict-prototypes -Wmissing-prototypes -Wcast-qual -Wold-style-definition -Wc++-compat -Wmissing-format-attribute -pedantic -Wno-long-long -Wno-variadic-macros -Wno-overlength-strings -fno-common  -DHAVE_CONFIG_H -I. -I. -I/Users/regress/tbox/svn-gcc/gcc -I/Users/regress/tbox/svn-gcc/gcc/. -I/Users/regress/tbox/svn-gcc/gcc/../include -I./../intl -I/Users/regress/tbox/svn-gcc/gcc/../libcpp/include  -I/Users/regress/tbox/svn-gcc/gcc/../libdecnumber -I/Users/regress/tbox/svn-gcc/gcc/../libdecnumber/dpd -I../libdecnumber    /Users/regress/tbox/svn-gcc/gcc/function.c -o function.o
gcc -c  -g -fkeep-inline-functions -DIN_GCC   -W -Wall -Wwrite-strings -Wstrict-prototypes -Wmissing-prototypes -Wcast-qual -Wold-style-definition -Wc++-compat -Wmissing-format-attribute -pedantic -Wno-long-long -Wno-variadic-macros -Wno-overlength-strings -fno-common  -DHAVE_CONFIG_H -I. -I. -I/Users/regress/tbox/svn-gcc/gcc -I/Users/regress/tbox/svn-gcc/gcc/. -I/Users/regress/tbox/svn-gcc/gcc/../include -I./../intl -I/Users/regress/tbox/svn-gcc/gcc/../libcpp/include  -I/Users/regress/tbox/svn-gcc/gcc/../libdecnumber -I/Users/regress/tbox/svn-gcc/gcc/../libdecnumber/dpd -I../libdecnumber    /Users/regress/tbox/svn-gcc/gcc/fwprop.c -o fwprop.o
gcc -c  -g -fkeep-inline-functions -DIN_GCC   -W -Wall -Wwrite-strings -Wstrict-prototypes -Wmissing-prototypes -Wcast-qual -Wold-style-definition -Wc++-compat -Wmissing-format-attribute -pedantic -Wno-long-long -Wno-variadic-macros -Wno-overlength-strings -fno-common  -DHAVE_CONFIG_H -I. -I. -I/Users/regress/tbox/svn-gcc/gcc -I/Users/regress/tbox/svn-gcc/gcc/. -I/Users/regress/tbox/svn-gcc/gcc/../include -I./../intl -I/Users/regress/tbox/svn-gcc/gcc/../libcpp/include  -I/Users/regress/tbox/svn-gcc/gcc/../libdecnumber -I/Users/regress/tbox/svn-gcc/gcc/../libdecnumber/dpd -I../libdecnumber    /Users/regress/tbox/svn-gcc/gcc/gcse.c -o gcse.o
/Users/regress/tbox/svn-gcc/gcc/gcse.c: In function 'gcse_constant_p':
/Users/regress/tbox/svn-gcc/gcc/gcse.c:1306: error: 'X' undeclared (first use in this function)
/Users/regress/tbox/svn-gcc/gcc/gcse.c:1306: error: (Each undeclared identifier is reported only once
/Users/regress/tbox/svn-gcc/gcc/gcse.c:1306: error: for each function it appears in.)
/Users/regress/tbox/svn-gcc/gcc/gcse.c:1307: warning: control reaches end of non-void function
make[3]: *** [gcse.o] Error 1
make[3]: *** Waiting for unfinished jobs....
/bin/sh /Users/regress/tbox/svn-gcc/gcc/../move-if-change tmp-automata.c insn-automata.c
echo timestamp > s-automata
rm gcov.pod fsf-funding.pod gfdl.pod cpp.pod gcc.pod
make[2]: *** [all-stage1-gcc] Error 2
make[1]: *** [stage1-bubble] Error 2
make: *** [bootstrap] Error 2
+ '[' -s .bad_compare ']'
+ exit 1
-------------- next part --------------

-- 
Geoffrey Keating <geoffk@apple.com> 
(via an automated GCC regression-testing script.)


More information about the Gcc-regression mailing list