GCC build failure, HEAD@146872 on native

regress regress@apple.com
Tue Apr 28 05:46:00 GMT 2009


With your recent patch, GCC HEAD revision 146872 had problems on:
native: build (about the same as the previous build)
Attached is build output for those targets.
The previous build was of revision 146870.

Log information for changes since the last build:
------------------------------------------------------------------------
r146871 | pault | 2009-04-27 22:16:19 -0700 (Mon, 27 Apr 2009) | 12 lines
Changed paths:
   M /trunk/gcc/fortran/ChangeLog
   M /trunk/gcc/fortran/trans-expr.c
   M /trunk/gcc/testsuite/ChangeLog
   A /trunk/gcc/testsuite/gfortran.dg/alloc_comp_assign_10.f90

2009-04-28  Paul Thomas  <pault@gcc.gnu.org>

	PR fortran/39879
	* trans_expr.c (gfc_conv_procedure_call): Deep copy a derived
	type parentheses argument if it is a variable with allocatable
	components.

2009-04-28  Paul Thomas  <pault@gcc.gnu.org>

	PR fortran/39879
	* gfortran.dg/alloc_comp_assign_10.f90: New test.

------------------------------------------------------------------------
r146872 | pault | 2009-04-27 22:29:44 -0700 (Mon, 27 Apr 2009) | 12 lines
Changed paths:
   M /trunk/gcc/fortran/trans-expr.c

2009-04-28  Paul Thomas  <pault@gcc.gnu.org>

	PR fortran/39879
	* trans_expr.c (gfc_conv_procedure_call): Deep copy a derived
	type parentheses argument if it is a variable with allocatable
	components.

2009-04-28  Paul Thomas  <pault@gcc.gnu.org>

	PR fortran/39879
	* gfortran.dg/alloc_comp_assign_10.f90: New test.

------------------------------------------------------------------------

For more information, see <http://gcc.gnu.org/regtest/HEAD/>.

-------------- next part --------------
{standard input}:193:non-relocatable subtraction expression, "LC1" minus "L00000000001$pb"
{standard input}:193:symbol: "L00000000001$pb" can't be undefined in a subtraction expression
{standard input}:175:non-relocatable subtraction expression, "LC0" minus "L00000000001$pb"
{standard input}:175:symbol: "L00000000001$pb" can't be undefined in a subtraction expression
{standard input}:174:non-relocatable subtraction expression, "LC0" minus "L00000000001$pb"
{standard input}:174:symbol: "L00000000001$pb" can't be undefined in a subtraction expression
{standard input}:135:non-relocatable subtraction expression, "LC2" minus "L00000000001$pb"
{standard input}:135:symbol: "L00000000001$pb" can't be undefined in a subtraction expression
{standard input}:131:non-relocatable subtraction expression, "LC2" minus "L00000000001$pb"
{standard input}:131:symbol: "L00000000001$pb" can't be undefined in a subtraction expression
{standard input}:unknown:Undefined local symbol L00000000001$pb
make[5]: *** [_floatdisf.o] Error 1
make[4]: *** [multi-do] Error 1
make[3]: *** [all-multi] Error 2
make[3]: *** Waiting for unfinished jobs....
make[2]: *** [all-stage1-target-libgcc] Error 2
make[1]: *** [stage1-bubble] Error 2
make: *** [bootstrap] Error 2
+ '[' -s .bad_compare ']'
+ exit 1
-------------- next part --------------

-- 
Geoffrey Keating <geoffk@apple.com> 
(via an automated GCC regression-testing script.)


More information about the Gcc-regression mailing list