GCC build failure, HEAD@146870 on native

regress regress@apple.com
Tue Apr 28 05:16:00 GMT 2009


With your recent patch, GCC HEAD revision 146870 had problems on:
native: build (about the same as the previous build)
Attached is build output for those targets.
The previous build was of revision 146869.

Log information for changes since the last build:
------------------------------------------------------------------------
r146870 | bje | 2009-04-27 21:56:47 -0700 (Mon, 27 Apr 2009) | 19 lines
Changed paths:
   M /trunk/gcc/ChangeLog
   M /trunk/gcc/builtins.c
   M /trunk/gcc/c-common.c
   M /trunk/gcc/c-common.h
   M /trunk/gcc/c-typeck.c
   M /trunk/gcc/cp/ChangeLog
   M /trunk/gcc/cp/typeck.c
   M /trunk/gcc/testsuite/ChangeLog
   M /trunk/gcc/testsuite/g++.dg/warn/pr35652.C
   M /trunk/gcc/testsuite/gcc.dg/format/plus-1.c
   M /trunk/gcc/testsuite/gcc.dg/pr35652.c

Revert:
	PR c++/35652
	2009-03-27  Manuel Lopez-Ibanez  <manu@gcc.gnu.org>

gcc/
	* builtins.c (c_strlen): Do not warn here.
	* c-typeck.c (build_binary_op): Adjust calls to pointer_int_sum.
	* c-common.c (pointer_int_sum): Take an explicit location.
	Warn about offsets out of bounds.
	* c-common.h (pointer_int_sum): Adjust declaration.

cp/
	* typeck.c (cp_pointer_sum): Adjust call to pointer_int_sum.

testsuite/
	* gcc.dg/pr35652.C: New.
	* g++.dg/warn/pr35652.C: New.
	* gcc.dg/format/plus-1.c: Adjust message.

------------------------------------------------------------------------

For more information, see <http://gcc.gnu.org/regtest/HEAD/>.

-------------- next part --------------
{standard input}:150:non-relocatable subtraction expression, "LC3" minus "L00000000001$pb"
{standard input}:150:symbol: "L00000000001$pb" can't be undefined in a subtraction expression
{standard input}:132:non-relocatable subtraction expression, "LC1" minus "L00000000001$pb"
{standard input}:132:symbol: "L00000000001$pb" can't be undefined in a subtraction expression
{standard input}:131:non-relocatable subtraction expression, "LC1" minus "L00000000001$pb"
{standard input}:131:symbol: "L00000000001$pb" can't be undefined in a subtraction expression
{standard input}:113:non-relocatable subtraction expression, "LC5" minus "L00000000001$pb"
{standard input}:113:symbol: "L00000000001$pb" can't be undefined in a subtraction expression
{standard input}:109:non-relocatable subtraction expression, "LC5" minus "L00000000001$pb"
{standard input}:109:symbol: "L00000000001$pb" can't be undefined in a subtraction expression
{standard input}:unknown:Undefined local symbol L00000000001$pb
make[5]: *** [_floatdidf.o] Error 1
make[4]: *** [multi-do] Error 1
make[3]: *** [all-multi] Error 2
make[3]: *** Waiting for unfinished jobs....
make[2]: *** [all-stage1-target-libgcc] Error 2
make[1]: *** [stage1-bubble] Error 2
make: *** [bootstrap] Error 2
+ '[' -s .bad_compare ']'
+ exit 1
-------------- next part --------------

-- 
Geoffrey Keating <geoffk@apple.com> 
(via an automated GCC regression-testing script.)


More information about the Gcc-regression mailing list