GCC build failure, HEAD@146864 on native

regress regress@apple.com
Mon Apr 27 23:46:00 GMT 2009


With your recent patch, GCC HEAD revision 146864 had problems on:
native: build (about the same as the previous build)
Attached is build output for those targets.
The previous build was of revision 146856.

Log information for changes since the last build:
------------------------------------------------------------------------
r146863 | dj | 2009-04-27 16:27:21 -0700 (Mon, 27 Apr 2009) | 13 lines
Changed paths:
   M /trunk/gcc/testsuite/ChangeLog
   M /trunk/gcc/testsuite/gcc.c-torture/execute/ieee/20010226-1.c
   M /trunk/gcc/testsuite/gcc.c-torture/execute/ieee/unsafe-fp-assoc-1.c
   M /trunk/gcc/testsuite/gcc.dg/Wconversion-real-integer.c
   M /trunk/gcc/testsuite/gcc.dg/Wconversion-real.c
   M /trunk/gcc/testsuite/gcc.dg/cdce1.c
   M /trunk/gcc/testsuite/gcc.dg/div-double-1.c
   M /trunk/gcc/testsuite/lib/target-supports.exp

* lib/target-supports.exp (check_effective_target_double64): New.
(check_effective_target_double64plus): New.
(check_effective_target_large_double): New.
* gcc.dg/Wconversion-real-integer.c: Require double64plus.
* gcc.dg/div-double-1.c: Likewise.
* gcc.dg/Wconversion-real.c: Require large_double.
* gcc.dg/cdce1.c: Require large_double instead of checking targets.

* gcc.c-torture/execute/ieee/unsafe-fp-assoc-1.c: Skip if doubles are too small.

* gcc.c-torture/execute/ieee/20010226-1.c: Mark all floating point
constants as long.

------------------------------------------------------------------------
r146864 | dj | 2009-04-27 16:30:03 -0700 (Mon, 27 Apr 2009) | 2 lines
Changed paths:
   M /trunk/gcc/testsuite/ChangeLog

Fix date

------------------------------------------------------------------------

For more information, see <http://gcc.gnu.org/regtest/HEAD/>.

-------------- next part --------------
{standard input}:150:non-relocatable subtraction expression, "LC3" minus "L00000000001$pb"
{standard input}:150:symbol: "L00000000001$pb" can't be undefined in a subtraction expression
{standard input}:132:non-relocatable subtraction expression, "LC1" minus "L00000000001$pb"
{standard input}:132:symbol: "L00000000001$pb" can't be undefined in a subtraction expression
{standard input}:131:non-relocatable subtraction expression, "LC1" minus "L00000000001$pb"
{standard input}:131:symbol: "L00000000001$pb" can't be undefined in a subtraction expression
{standard input}:113:non-relocatable subtraction expression, "LC5" minus "L00000000001$pb"
{standard input}:113:symbol: "L00000000001$pb" can't be undefined in a subtraction expression
{standard input}:109:non-relocatable subtraction expression, "LC5" minus "L00000000001$pb"
{standard input}:109:symbol: "L00000000001$pb" can't be undefined in a subtraction expression
{standard input}:unknown:Undefined local symbol L00000000001$pb
make[5]: *** [_floatdidf.o] Error 1
make[4]: *** [multi-do] Error 1
make[3]: *** [all-multi] Error 2
make[3]: *** Waiting for unfinished jobs....
make[2]: *** [all-stage1-target-libgcc] Error 2
make[1]: *** [stage1-bubble] Error 2
make: *** [bootstrap] Error 2
+ '[' -s .bad_compare ']'
+ exit 1
-------------- next part --------------

-- 
Geoffrey Keating <geoffk@apple.com> 
(via an automated GCC regression-testing script.)


More information about the Gcc-regression mailing list