GCC build failure, HEAD@146851 on native

regress regress@apple.com
Mon Apr 27 19:31:00 GMT 2009


With your recent patch, GCC HEAD revision 146851 had problems on:
native: build (seems to have stopped earlier)
Attached is build output for those targets.
The previous build was of revision 146849.

Log information for changes since the last build:
------------------------------------------------------------------------
r146850 | jakub | 2009-04-27 12:11:23 -0700 (Mon, 27 Apr 2009) | 7 lines
Changed paths:
   M /trunk/contrib/ChangeLog
   M /trunk/contrib/dg-extract-results.sh

	PR testsuite/39807
	* dg-extract-results.sh: Close open files and use >> instead of >
	to decrease number of concurrently open files from awk.  Avoid
	= at the beginning of a regexp and redirect to a file determined
	by curfile variable rather than concatenated strings to workaround
	Solaris nawk bug.

------------------------------------------------------------------------

For more information, see <http://gcc.gnu.org/regtest/HEAD/>.

-------------- next part --------------
{standard input}:150:non-relocatable subtraction expression, "LC3" minus "L00000000001$pb"
{standard input}:150:symbol: "L00000000001$pb" can't be undefined in a subtraction expression
{standard input}:132:non-relocatable subtraction expression, "LC1" minus "L00000000001$pb"
{standard input}:132:symbol: "L00000000001$pb" can't be undefined in a subtraction expression
{standard input}:131:non-relocatable subtraction expression, "LC1" minus "L00000000001$pb"
{standard input}:131:symbol: "L00000000001$pb" can't be undefined in a subtraction expression
{standard input}:113:non-relocatable subtraction expression, "LC5" minus "L00000000001$pb"
{standard input}:113:symbol: "L00000000001$pb" can't be undefined in a subtraction expression
{standard input}:109:non-relocatable subtraction expression, "LC5" minus "L00000000001$pb"
{standard input}:109:symbol: "L00000000001$pb" can't be undefined in a subtraction expression
{standard input}:unknown:Undefined local symbol L00000000001$pb
make[5]: *** [_floatdidf.o] Error 1
make[4]: *** [multi-do] Error 1
make[3]: *** [all-multi] Error 2
make[3]: *** Waiting for unfinished jobs....
make[2]: *** [all-stage1-target-libgcc] Error 2
make[1]: *** [stage1-bubble] Error 2
make: *** [bootstrap] Error 2
+ '[' -s .bad_compare ']'
+ exit 1
-------------- next part --------------

-- 
Geoffrey Keating <geoffk@apple.com> 
(via an automated GCC regression-testing script.)


More information about the Gcc-regression mailing list