GCC build failure, HEAD@146842 on native

regress regress@apple.com
Mon Apr 27 14:31:00 GMT 2009


With your recent patch, GCC HEAD revision 146842 had problems on:
native: build (about the same as the previous build)
Attached is build output for those targets.
The previous build was of revision 146838.

Log information for changes since the last build:
------------------------------------------------------------------------
r146842 | hjl | 2009-04-27 07:02:09 -0700 (Mon, 27 Apr 2009) | 17 lines
Changed paths:
   M /trunk/gcc/ChangeLog
   M /trunk/gcc/config/i386/i386.c
   M /trunk/gcc/testsuite/ChangeLog
   A /trunk/gcc/testsuite/gcc.dg/torture/pr39903-1.c
   A /trunk/gcc/testsuite/gcc.dg/torture/pr39903-2.c

gcc/

2009-04-27  H.J. Lu  <hongjiu.lu@intel.com>

	PR target/39903
	* config/i386/i386.c (construct_container): Don't call
	gen_reg_or_parallel with BLKmode on X86_64_SSE_CLASS,
	X86_64_SSESF_CLASS and X86_64_SSEDF_CLASS.

gcc/testsuite/

2009-04-27  H.J. Lu  <hongjiu.lu@intel.com>

	PR target/39903
	* gcc.dg/torture/pr39903-1.c: New.
	* gcc.dg/torture/pr39903-2.c: Likewise.

------------------------------------------------------------------------

For more information, see <http://gcc.gnu.org/regtest/HEAD/>.

-------------- next part --------------
{standard input}:193:non-relocatable subtraction expression, "LC1" minus "L00000000001$pb"
{standard input}:193:symbol: "L00000000001$pb" can't be undefined in a subtraction expression
{standard input}:175:non-relocatable subtraction expression, "LC0" minus "L00000000001$pb"
{standard input}:175:symbol: "L00000000001$pb" can't be undefined in a subtraction expression
{standard input}:174:non-relocatable subtraction expression, "LC0" minus "L00000000001$pb"
{standard input}:174:symbol: "L00000000001$pb" can't be undefined in a subtraction expression
{standard input}:135:non-relocatable subtraction expression, "LC2" minus "L00000000001$pb"
{standard input}:135:symbol: "L00000000001$pb" can't be undefined in a subtraction expression
{standard input}:131:non-relocatable subtraction expression, "LC2" minus "L00000000001$pb"
{standard input}:131:symbol: "L00000000001$pb" can't be undefined in a subtraction expression
{standard input}:unknown:Undefined local symbol L00000000001$pb
make[5]: *** [_floatdisf.o] Error 1
make[4]: *** [multi-do] Error 1
make[3]: *** [all-multi] Error 2
make[3]: *** Waiting for unfinished jobs....
make[2]: *** [all-stage1-target-libgcc] Error 2
make[1]: *** [stage1-bubble] Error 2
make: *** [bootstrap] Error 2
+ '[' -s .bad_compare ']'
+ exit 1
-------------- next part --------------

-- 
Geoffrey Keating <geoffk@apple.com> 
(via an automated GCC regression-testing script.)


More information about the Gcc-regression mailing list