GCC build failure, HEAD@146826 on native

regress regress@apple.com
Mon Apr 27 07:46:00 GMT 2009


With your recent patch, GCC HEAD revision 146826 had problems on:
native: build (about the same as the previous build)
Attached is build output for those targets.
The previous build was of revision 146825.

Log information for changes since the last build:
------------------------------------------------------------------------
r146826 | uros | 2009-04-27 00:20:29 -0700 (Mon, 27 Apr 2009) | 3 lines
Changed paths:
   M /trunk/gcc/ChangeLog
   M /trunk/gcc/config/alpha/alpha.c

	* config/alpha/alpha.c (code_for_builtin): Declare as enum insn_code.


------------------------------------------------------------------------

For more information, see <http://gcc.gnu.org/regtest/HEAD/>.

-------------- next part --------------
{standard input}:193:non-relocatable subtraction expression, "LC1" minus "L00000000001$pb"
{standard input}:193:symbol: "L00000000001$pb" can't be undefined in a subtraction expression
{standard input}:175:non-relocatable subtraction expression, "LC0" minus "L00000000001$pb"
{standard input}:175:symbol: "L00000000001$pb" can't be undefined in a subtraction expression
{standard input}:174:non-relocatable subtraction expression, "LC0" minus "L00000000001$pb"
{standard input}:174:symbol: "L00000000001$pb" can't be undefined in a subtraction expression
{standard input}:135:non-relocatable subtraction expression, "LC2" minus "L00000000001$pb"
{standard input}:135:symbol: "L00000000001$pb" can't be undefined in a subtraction expression
{standard input}:131:non-relocatable subtraction expression, "LC2" minus "L00000000001$pb"
{standard input}:131:symbol: "L00000000001$pb" can't be undefined in a subtraction expression
{standard input}:unknown:Undefined local symbol L00000000001$pb
make[5]: *** [_floatdisf.o] Error 1
make[4]: *** [multi-do] Error 1
make[3]: *** [all-multi] Error 2
make[3]: *** Waiting for unfinished jobs....
make[2]: *** [all-stage1-target-libgcc] Error 2
make[1]: *** [stage1-bubble] Error 2
make: *** [bootstrap] Error 2
+ '[' -s .bad_compare ']'
+ exit 1
-------------- next part --------------

-- 
Geoffrey Keating <geoffk@apple.com> 
(via an automated GCC regression-testing script.)


More information about the Gcc-regression mailing list