GCC build failure, HEAD@145857 on native

regress regress@apple.com
Thu Apr 9 21:27:00 GMT 2009


With your recent patch, GCC HEAD revision 145857 had problems on:
native: build (about the same as the previous build)
Attached is build output for those targets.
The previous build was of revision 145856.

Log information for changes since the last build:
------------------------------------------------------------------------
r145857 | ayers | 2009-04-09 14:08:18 -0700 (Thu, 09 Apr 2009) | 9 lines
Changed paths:
   M /trunk/gcc/ChangeLog
   M /trunk/gcc/objc/objc-act.c

gcc/
2009-04-09  David Ayers  <ayers@fsfe.org>

	PR objc/29200
	* objc/objc-act.c (warn_with_method): Remove helper function.
	(check_duplicates): Call warning and inform directly.
	(really_start_method): Likewise.


------------------------------------------------------------------------

For more information, see <http://gcc.gnu.org/regtest/HEAD/>.

-------------- next part --------------
/Users/regress/tbox/native/build/./gcc/xgcc -B/Users/regress/tbox/native/build/./gcc/ -B/Users/regress/tbox/objs/powerpc-apple-darwin9.6.0/bin/ -B/Users/regress/tbox/objs/powerpc-apple-darwin9.6.0/lib/ -isystem /Users/regress/tbox/objs/powerpc-apple-darwin9.6.0/include -isystem /Users/regress/tbox/objs/powerpc-apple-darwin9.6.0/sys-include -g -O2 -m64 -O2  -g -O2 -DIN_GCC   -W -Wall -Wwrite-strings -Wstrict-prototypes -Wmissing-prototypes -Wcast-qual -Wold-style-definition  -isystem ./include  -Wa,-force_cpusubtype_ALL -pipe -mmacosx-version-min=10.4 -g -DHAVE_GTHR_DEFAULT -DIN_LIBGCC2 -D__GCC_FLOAT_NOT_NEEDED   -I. -I. -I../../.././gcc -I/Users/regress/tbox/svn-gcc/libgcc -I/Users/regress/tbox/svn-gcc/libgcc/. -I/Users/regress/tbox/svn-gcc/libgcc/../gcc -I/Users/regress/tbox/svn-gcc/libgcc/../include  -DHAVE_CC_TLS -o ppc64-fp.o -MT ppc64-fp.o -MD -MP -MF ppc64-fp.dep -fexceptions -c /Users/regress/tbox/svn-gcc/libgcc/../gcc/config/rs6000/ppc64-fp.c -fvisibility=hidden -DHID
 E_EXPORTS
/Users/regress/tbox/native/build/./gcc/xgcc -B/Users/regress/tbox/native/build/./gcc/ -B/Users/regress/tbox/objs/powerpc-apple-darwin9.6.0/bin/ -B/Users/regress/tbox/objs/powerpc-apple-darwin9.6.0/lib/ -isystem /Users/regress/tbox/objs/powerpc-apple-darwin9.6.0/include -isystem /Users/regress/tbox/objs/powerpc-apple-darwin9.6.0/sys-include -g -O2 -O2  -g -O2 -DIN_GCC   -W -Wall -Wwrite-strings -Wstrict-prototypes -Wmissing-prototypes -Wcast-qual -Wold-style-definition  -isystem ./include  -Wa,-force_cpusubtype_ALL -pipe -mmacosx-version-min=10.4 -g -DHAVE_GTHR_DEFAULT -DIN_LIBGCC2 -D__GCC_FLOAT_NOT_NEEDED   -I. -I. -I../.././gcc -I/Users/regress/tbox/svn-gcc/libgcc -I/Users/regress/tbox/svn-gcc/libgcc/. -I/Users/regress/tbox/svn-gcc/libgcc/../gcc -I/Users/regress/tbox/svn-gcc/libgcc/../include  -DHAVE_CC_TLS -o darwin-ldouble_s.o -MT darwin-ldouble_s.o -MD -MP -MF darwin-ldouble_s.dep -DSHARED -fexceptions -c /Users/regress/tbox/svn-gcc/libgcc/../gcc/config/rs6000/darwin-ldou
 ble.c
/Users/regress/tbox/native/build/./gcc/xgcc -B/Users/regress/tbox/native/build/./gcc/ -B/Users/regress/tbox/objs/powerpc-apple-darwin9.6.0/bin/ -B/Users/regress/tbox/objs/powerpc-apple-darwin9.6.0/lib/ -isystem /Users/regress/tbox/objs/powerpc-apple-darwin9.6.0/include -isystem /Users/regress/tbox/objs/powerpc-apple-darwin9.6.0/sys-include -g -O2 -O2  -g -O2 -DIN_GCC   -W -Wall -Wwrite-strings -Wstrict-prototypes -Wmissing-prototypes -Wcast-qual -Wold-style-definition  -isystem ./include  -Wa,-force_cpusubtype_ALL -pipe -mmacosx-version-min=10.4 -g -DHAVE_GTHR_DEFAULT -DIN_LIBGCC2 -D__GCC_FLOAT_NOT_NEEDED   -I. -I. -I../.././gcc -I/Users/regress/tbox/svn-gcc/libgcc -I/Users/regress/tbox/svn-gcc/libgcc/. -I/Users/regress/tbox/svn-gcc/libgcc/../gcc -I/Users/regress/tbox/svn-gcc/libgcc/../include  -DHAVE_CC_TLS -o darwin-world_s.o -MT darwin-world_s.o -MD -MP -MF darwin-world_s.dep -DSHARED -c -xassembler-with-cpp /Users/regress/tbox/svn-gcc/libgcc/../gcc/config/rs6000/darwin-wo
 rld.asm
/Users/regress/tbox/native/build/./gcc/xgcc -B/Users/regress/tbox/native/build/./gcc/ -B/Users/regress/tbox/objs/powerpc-apple-darwin9.6.0/bin/ -B/Users/regress/tbox/objs/powerpc-apple-darwin9.6.0/lib/ -isystem /Users/regress/tbox/objs/powerpc-apple-darwin9.6.0/include -isystem /Users/regress/tbox/objs/powerpc-apple-darwin9.6.0/sys-include -g -O2 -O2  -g -O2 -DIN_GCC   -W -Wall -Wwrite-strings -Wstrict-prototypes -Wmissing-prototypes -Wcast-qual -Wold-style-definition  -isystem ./include  -Wa,-force_cpusubtype_ALL -pipe -mmacosx-version-min=10.4 -g -DHAVE_GTHR_DEFAULT -DIN_LIBGCC2 -D__GCC_FLOAT_NOT_NEEDED   -I. -I. -I../.././gcc -I/Users/regress/tbox/svn-gcc/libgcc -I/Users/regress/tbox/svn-gcc/libgcc/. -I/Users/regress/tbox/svn-gcc/libgcc/../gcc -I/Users/regress/tbox/svn-gcc/libgcc/../include  -DHAVE_CC_TLS -o unwind-dw2_s.o -MT unwind-dw2_s.o -MD -MP -MF unwind-dw2_s.dep -DSHARED -fexceptions -c /Users/regress/tbox/svn-gcc/libgcc/../gcc/unwind-dw2.c
/Users/regress/tbox/native/build/./gcc/xgcc -B/Users/regress/tbox/native/build/./gcc/ -B/Users/regress/tbox/objs/powerpc-apple-darwin9.6.0/bin/ -B/Users/regress/tbox/objs/powerpc-apple-darwin9.6.0/lib/ -isystem /Users/regress/tbox/objs/powerpc-apple-darwin9.6.0/include -isystem /Users/regress/tbox/objs/powerpc-apple-darwin9.6.0/sys-include -g -O2 -m64 -O2  -g -O2 -DIN_GCC   -W -Wall -Wwrite-strings -Wstrict-prototypes -Wmissing-prototypes -Wcast-qual -Wold-style-definition  -isystem ./include  -Wa,-force_cpusubtype_ALL -pipe -mmacosx-version-min=10.4 -g -DHAVE_GTHR_DEFAULT -DIN_LIBGCC2 -D__GCC_FLOAT_NOT_NEEDED   -I. -I. -I../../.././gcc -I/Users/regress/tbox/svn-gcc/libgcc -I/Users/regress/tbox/svn-gcc/libgcc/. -I/Users/regress/tbox/svn-gcc/libgcc/../gcc -I/Users/regress/tbox/svn-gcc/libgcc/../include  -DHAVE_CC_TLS -o darwin-64.o -MT darwin-64.o -MD -MP -MF darwin-64.dep -fexceptions -c /Users/regress/tbox/svn-gcc/libgcc/../gcc/config/darwin-64.c -fvisibility=hidden -DHIDE_E
 XPORTS
/Users/regress/tbox/native/build/./gcc/xgcc -B/Users/regress/tbox/native/build/./gcc/ -B/Users/regress/tbox/objs/powerpc-apple-darwin9.6.0/bin/ -B/Users/regress/tbox/objs/powerpc-apple-darwin9.6.0/lib/ -isystem /Users/regress/tbox/objs/powerpc-apple-darwin9.6.0/include -isystem /Users/regress/tbox/objs/powerpc-apple-darwin9.6.0/sys-include -g -O2 -m64 -O2  -g -O2 -DIN_GCC   -W -Wall -Wwrite-strings -Wstrict-prototypes -Wmissing-prototypes -Wcast-qual -Wold-style-definition  -isystem ./include  -Wa,-force_cpusubtype_ALL -pipe -mmacosx-version-min=10.4 -g -DHAVE_GTHR_DEFAULT -DIN_LIBGCC2 -D__GCC_FLOAT_NOT_NEEDED   -I. -I. -I../../.././gcc -I/Users/regress/tbox/svn-gcc/libgcc -I/Users/regress/tbox/svn-gcc/libgcc/. -I/Users/regress/tbox/svn-gcc/libgcc/../gcc -I/Users/regress/tbox/svn-gcc/libgcc/../include  -DHAVE_CC_TLS -o darwin-ldouble.o -MT darwin-ldouble.o -MD -MP -MF darwin-ldouble.dep -fexceptions -c /Users/regress/tbox/svn-gcc/libgcc/../gcc/config/rs6000/darwin-ldouble.c -
 fvisibility=hidden -DHIDE_EXPORTS
/Users/regress/tbox/native/build/./gcc/xgcc -B/Users/regress/tbox/native/build/./gcc/ -B/Users/regress/tbox/objs/powerpc-apple-darwin9.6.0/bin/ -B/Users/regress/tbox/objs/powerpc-apple-darwin9.6.0/lib/ -isystem /Users/regress/tbox/objs/powerpc-apple-darwin9.6.0/include -isystem /Users/regress/tbox/objs/powerpc-apple-darwin9.6.0/sys-include -g -O2 -m64 -O2  -g -O2 -DIN_GCC   -W -Wall -Wwrite-strings -Wstrict-prototypes -Wmissing-prototypes -Wcast-qual -Wold-style-definition  -isystem ./include  -Wa,-force_cpusubtype_ALL -pipe -mmacosx-version-min=10.4 -g -DHAVE_GTHR_DEFAULT -DIN_LIBGCC2 -D__GCC_FLOAT_NOT_NEEDED   -I. -I. -I../../.././gcc -I/Users/regress/tbox/svn-gcc/libgcc -I/Users/regress/tbox/svn-gcc/libgcc/. -I/Users/regress/tbox/svn-gcc/libgcc/../gcc -I/Users/regress/tbox/svn-gcc/libgcc/../include  -DHAVE_CC_TLS -o darwin-world_s.o -MT darwin-world_s.o -MD -MP -MF darwin-world_s.dep -DSHARED -c -xassembler-with-cpp /Users/regress/tbox/svn-gcc/libgcc/../gcc/config/rs6000/d
 arwin-world.asm
/Users/regress/tbox/native/build/./gcc/xgcc -B/Users/regress/tbox/native/build/./gcc/ -B/Users/regress/tbox/objs/powerpc-apple-darwin9.6.0/bin/ -B/Users/regress/tbox/objs/powerpc-apple-darwin9.6.0/lib/ -isystem /Users/regress/tbox/objs/powerpc-apple-darwin9.6.0/include -isystem /Users/regress/tbox/objs/powerpc-apple-darwin9.6.0/sys-include -g -O2 -m64 -O2  -g -O2 -DIN_GCC   -W -Wall -Wwrite-strings -Wstrict-prototypes -Wmissing-prototypes -Wcast-qual -Wold-style-definition  -isystem ./include  -Wa,-force_cpusubtype_ALL -pipe -mmacosx-version-min=10.4 -g -DHAVE_GTHR_DEFAULT -DIN_LIBGCC2 -D__GCC_FLOAT_NOT_NEEDED   -I. -I. -I../../.././gcc -I/Users/regress/tbox/svn-gcc/libgcc -I/Users/regress/tbox/svn-gcc/libgcc/. -I/Users/regress/tbox/svn-gcc/libgcc/../gcc -I/Users/regress/tbox/svn-gcc/libgcc/../include  -DHAVE_CC_TLS -o darwin-fpsave_s.o -MT darwin-fpsave_s.o -MD -MP -MF darwin-fpsave_s.dep -DSHARED -c -xassembler-with-cpp /Users/regress/tbox/svn-gcc/libgcc/../gcc/config/rs600
 0/darwin-fpsave.asm
/Users/regress/tbox/native/build/./gcc/xgcc -B/Users/regress/tbox/native/build/./gcc/ -B/Users/regress/tbox/objs/powerpc-apple-darwin9.6.0/bin/ -B/Users/regress/tbox/objs/powerpc-apple-darwin9.6.0/lib/ -isystem /Users/regress/tbox/objs/powerpc-apple-darwin9.6.0/include -isystem /Users/regress/tbox/objs/powerpc-apple-darwin9.6.0/sys-include -g -O2 -m64 -O2  -g -O2 -DIN_GCC   -W -Wall -Wwrite-strings -Wstrict-prototypes -Wmissing-prototypes -Wcast-qual -Wold-style-definition  -isystem ./include  -Wa,-force_cpusubtype_ALL -pipe -mmacosx-version-min=10.4 -g -DHAVE_GTHR_DEFAULT -DIN_LIBGCC2 -D__GCC_FLOAT_NOT_NEEDED   -I. -I. -I../../.././gcc -I/Users/regress/tbox/svn-gcc/libgcc -I/Users/regress/tbox/svn-gcc/libgcc/. -I/Users/regress/tbox/svn-gcc/libgcc/../gcc -I/Users/regress/tbox/svn-gcc/libgcc/../include  -DHAVE_CC_TLS -o darwin-vecsave_s.o -MT darwin-vecsave_s.o -MD -MP -MF darwin-vecsave_s.dep -DSHARED -c -xassembler-with-cpp /Users/regress/tbox/svn-gcc/libgcc/../gcc/config/rs
 6000/darwin-vecsave.asm
/Users/regress/tbox/svn-gcc/libgcc/../gcc/config/rs6000/darwin-vecsave.asm:23:Junk character 42 (*).
/Users/regress/tbox/svn-gcc/libgcc/../gcc/config/rs6000/darwin-vecsave.asm:23:Rest of line ignored. 1st junk character valued 47 (/).
make[5]: *** [darwin-vecsave_s.o] Error 1
make[4]: *** [multi-do] Error 1
make[3]: *** [all-multi] Error 2
make[3]: *** Waiting for unfinished jobs....
make[2]: *** [all-stage1-target-libgcc] Error 2
make[1]: *** [stage1-bubble] Error 2
make: *** [bootstrap] Error 2
+ '[' -s .bad_compare ']'
+ exit 1
-------------- next part --------------

-- 
Geoffrey Keating <geoffk@apple.com> 
(via an automated GCC regression-testing script.)


More information about the Gcc-regression mailing list