GCC build of HEAD@136698 failed for native

GCC regression tester regress@geoffk.org
Thu Jun 12 11:31:00 GMT 2008


With your recent patch, GCC HEAD revision 136698 had problems on:
native: build (NEW build failure)
Attached is build output for those targets.
The previous build was of revision 136695.

Log information for changes since the last build:
------------------------------------------------------------------------
r136696 | jakub | 2008-06-12 11:03:50 +0000 (Thu, 12 Jun 2008) | 6 lines
Changed paths:
   M /trunk/gcc/ChangeLog
   M /trunk/gcc/omp-low.c
   M /trunk/libgomp/ChangeLog
   A /trunk/libgomp/testsuite/libgomp.c/reduction-5.c

	PR middle-end/36506
	* omp-low.c (expand_omp_sections): Handle #pragma omp sections with
	reductions.

	* testsuite/libgomp.c/reduction-5.c: New test.

------------------------------------------------------------------------
r136698 | jakub | 2008-06-12 11:17:05 +0000 (Thu, 12 Jun 2008) | 5 lines
Changed paths:
   M /trunk/gcc/testsuite/ChangeLog
   M /trunk/gcc/testsuite/g++.dg/compat/struct-layout-1.exp
   M /trunk/gcc/testsuite/gcc.dg/compat/struct-layout-1.exp

	PR testsuite/36443
	* gcc.dg/compat/struct-layout-1.exp: Temporarily unset
	GCC_EXEC_PREFIX from environment when running $HOSTCC.
	* g++.dg/compat/struct-layout-1.exp: Likewise.

------------------------------------------------------------------------

For more information, see <http://glutton.geoffk.org/HEAD/>.

-------------- next part --------------
/home/regress/tbox/native/build/./prev-gcc/xgcc -B/home/regress/tbox/native/build/./prev-gcc/ -B/home/regress/tbox/objs/i686-pc-linux-gnu/bin/ -c  -g -O2 -fomit-frame-pointer -DIN_GCC   -W -Wall -Wwrite-strings -Wstrict-prototypes -Wmissing-prototypes -Wold-style-definition -Wmissing-format-attribute -pedantic -Wno-long-long -Wno-variadic-macros 				     -Wno-overlength-strings -Werror -fno-common  -DHAVE_CONFIG_H -I. -I. -I/home/regress/tbox/svn-gcc/gcc -I/home/regress/tbox/svn-gcc/gcc/. -I/home/regress/tbox/svn-gcc/gcc/../include -I/home/regress/tbox/svn-gcc/gcc/../libcpp/include  -I/home/regress/tbox/svn-gcc/gcc/../libdecnumber -I/home/regress/tbox/svn-gcc/gcc/../libdecnumber/bid -I../libdecnumber  /home/regress/tbox/svn-gcc/gcc/opts.c -o opts.o
cc1: warnings being treated as errors
/home/regress/tbox/svn-gcc/gcc/omp-low.c: In function 'expand_omp_sections':
/home/regress/tbox/svn-gcc/gcc/omp-low.c:4388: error: 'l2' may be used uninitialized in this function
/home/regress/tbox/native/build/./prev-gcc/xgcc -B/home/regress/tbox/native/build/./prev-gcc/ -B/home/regress/tbox/objs/i686-pc-linux-gnu/bin/ -c  -g -O2 -fomit-frame-pointer -DIN_GCC   -W -Wall -Wwrite-strings -Wstrict-prototypes -Wmissing-prototypes -Wold-style-definition -Wmissing-format-attribute -pedantic -Wno-long-long -Wno-variadic-macros 				     -Wno-overlength-strings -Werror -fno-common  -DHAVE_CONFIG_H -I. -I. -I/home/regress/tbox/svn-gcc/gcc -I/home/regress/tbox/svn-gcc/gcc/. -I/home/regress/tbox/svn-gcc/gcc/../include -I/home/regress/tbox/svn-gcc/gcc/../libcpp/include  -I/home/regress/tbox/svn-gcc/gcc/../libdecnumber -I/home/regress/tbox/svn-gcc/gcc/../libdecnumber/bid -I../libdecnumber  /home/regress/tbox/svn-gcc/gcc/params.c -o params.o
/home/regress/tbox/native/build/./prev-gcc/xgcc -B/home/regress/tbox/native/build/./prev-gcc/ -B/home/regress/tbox/objs/i686-pc-linux-gnu/bin/ -c  -g -O2 -fomit-frame-pointer -DIN_GCC   -W -Wall -Wwrite-strings -Wstrict-prototypes -Wmissing-prototypes -Wold-style-definition -Wmissing-format-attribute -pedantic -Wno-long-long -Wno-variadic-macros 				     -Wno-overlength-strings -Werror -fno-common  -DHAVE_CONFIG_H -I. -I. -I/home/regress/tbox/svn-gcc/gcc -I/home/regress/tbox/svn-gcc/gcc/. -I/home/regress/tbox/svn-gcc/gcc/../include -I/home/regress/tbox/svn-gcc/gcc/../libcpp/include  -I/home/regress/tbox/svn-gcc/gcc/../libdecnumber -I/home/regress/tbox/svn-gcc/gcc/../libdecnumber/bid -I../libdecnumber  /home/regress/tbox/svn-gcc/gcc/passes.c -o passes.o
/home/regress/tbox/native/build/./prev-gcc/xgcc -B/home/regress/tbox/native/build/./prev-gcc/ -B/home/regress/tbox/objs/i686-pc-linux-gnu/bin/ -c  -g -O2 -fomit-frame-pointer -DIN_GCC   -W -Wall -Wwrite-strings -Wstrict-prototypes -Wmissing-prototypes -Wold-style-definition -Wmissing-format-attribute -pedantic -Wno-long-long -Wno-variadic-macros 				     -Wno-overlength-strings -Werror -fno-common  -DHAVE_CONFIG_H -I. -I. -I/home/regress/tbox/svn-gcc/gcc -I/home/regress/tbox/svn-gcc/gcc/. -I/home/regress/tbox/svn-gcc/gcc/../include -I/home/regress/tbox/svn-gcc/gcc/../libcpp/include  -I/home/regress/tbox/svn-gcc/gcc/../libdecnumber -I/home/regress/tbox/svn-gcc/gcc/../libdecnumber/bid -I../libdecnumber  /home/regress/tbox/svn-gcc/gcc/pointer-set.c -o pointer-set.o
/home/regress/tbox/native/build/./prev-gcc/xgcc -B/home/regress/tbox/native/build/./prev-gcc/ -B/home/regress/tbox/objs/i686-pc-linux-gnu/bin/ -c  -g -O2 -fomit-frame-pointer -DIN_GCC   -W -Wall -Wwrite-strings -Wstrict-prototypes -Wmissing-prototypes -Wold-style-definition -Wmissing-format-attribute -pedantic -Wno-long-long -Wno-variadic-macros 				     -Wno-overlength-strings -Werror -fno-common  -DHAVE_CONFIG_H -I. -I. -I/home/regress/tbox/svn-gcc/gcc -I/home/regress/tbox/svn-gcc/gcc/. -I/home/regress/tbox/svn-gcc/gcc/../include -I/home/regress/tbox/svn-gcc/gcc/../libcpp/include  -I/home/regress/tbox/svn-gcc/gcc/../libdecnumber -I/home/regress/tbox/svn-gcc/gcc/../libdecnumber/bid -I../libdecnumber  /home/regress/tbox/svn-gcc/gcc/postreload-gcse.c -o postreload-gcse.o
/home/regress/tbox/native/build/./prev-gcc/xgcc -B/home/regress/tbox/native/build/./prev-gcc/ -B/home/regress/tbox/objs/i686-pc-linux-gnu/bin/ -c  -g -O2 -fomit-frame-pointer -DIN_GCC   -W -Wall -Wwrite-strings -Wstrict-prototypes -Wmissing-prototypes -Wold-style-definition -Wmissing-format-attribute -pedantic -Wno-long-long -Wno-variadic-macros 				     -Wno-overlength-strings -Werror -fno-common  -DHAVE_CONFIG_H -I. -I. -I/home/regress/tbox/svn-gcc/gcc -I/home/regress/tbox/svn-gcc/gcc/. -I/home/regress/tbox/svn-gcc/gcc/../include -I/home/regress/tbox/svn-gcc/gcc/../libcpp/include  -I/home/regress/tbox/svn-gcc/gcc/../libdecnumber -I/home/regress/tbox/svn-gcc/gcc/../libdecnumber/bid -I../libdecnumber  /home/regress/tbox/svn-gcc/gcc/postreload.c -o postreload.o
make[3]: *** [omp-low.o] Error 1
make[3]: *** Waiting for unfinished jobs....
rm gcj-dbtool.pod fsf-funding.pod jcf-dump.pod jv-convert.pod grmic.pod gcov.pod gcj.pod gc-analyze.pod gfdl.pod cpp.pod gij.pod gfortran.pod gcc.pod
make[3]: Leaving directory `/home/regress/tbox/native/build/gcc'
make[2]: *** [all-stage2-gcc] Error 2
make[2]: Leaving directory `/home/regress/tbox/native/build'
make[1]: *** [stage2-bubble] Error 2
make[1]: Leaving directory `/home/regress/tbox/native/build'
make: *** [bootstrap] Error 2
+ '[' -s .bad_compare ']'
+ exit 1
-------------- next part --------------

-- 
Geoffrey Keating <geoffk@geoffk.org> 
(via an automated GCC regression-testing script.)


More information about the Gcc-regression mailing list