GCC build of gcc-3_4-branch failed for native with your patch on 2004-06-24T19:45:09Z.

GCC regression checker geoffk@apple.com
Thu Jun 24 20:33:00 GMT 2004


With your recent patch, GCC gcc-3_4-branch does not compile on:
 native
Attached is build output for those targets.

The build failures are new.

For more information, see http://gcc.gnu.org/regtest/.

-------------- next part --------------
ChangeLog entries since last run on 2004-06-23T11:52:23Z:
--- /Users/regress/tbox/changelog_mail/gcc/gcc/ChangeLog	Wed Jun 23 04:53:57 2004
+++ gcc/gcc/ChangeLog	Thu Jun 24 12:46:17 2004
@@ -1,3 +1,8 @@
+2004-06-24  Alan Modra  <amodra@bigpond.net.au>
+
+	* calls.c (expand_call): Call INIT_CUMULATIVE_ARGS earlier, and
+	pass raw n_named_args to it.
+
 2004-06-22  Richard Henderson  <rth@redhat.com>
 
 	PR middle-end/16026
--- /Users/regress/tbox/changelog_mail/gcc/gcc/testsuite/ChangeLog	Wed Jun 23 04:55:20 2004
+++ gcc/gcc/testsuite/ChangeLog	Wed Jun 23 04:55:20 2004
@@ -3549,7 +3549,7 @@
 
 2003-08-02  Kaveh R. Ghazi  <ghazi@caip.rutgers.edu>
 
-	* gcc.dg?"uiltinc-1.c: Atd macro`helpers.  Add missing math
+	* gcc.dg/builtins-1.c: Add macro helpers.  Add missing math
 	builtins.  Move cases from builtins-4.c here.
 
 	* gcc.dg/torture/builtin-math-1.c: New test taken from
--- /Users/regress/tbox/changelog_mail/gcc/libstdc++-v3/ChangeLog	Tue Jun 22 10:53:14 2004
+++ gcc/libstdc++-v3/ChangeLog	Wed Jun 23 23:08:50 2004
@@ -1,3 +1,10 @@
+2004-06-23  Paolo Carlini  <pcarlini@suse.de>
+
+	PR libstdc++/16154
+	* include/bits/boost_concept_check.h (struct _TrivialIteratorConcept):
+	Don't require the _DefaultConstructibleConcept.
+	(struct _ForwardIteratorConcept): Require it here.
+
 2004-06-21  Loren J. Rittle  <ljrittle@acm.org>
 
 	* config/linker-map.gnu: Use wildcards for
--- /Users/regress/tbox/changelog_mail/gcc/libjava/ChangeLog	Tue May  4 03:13:58 2004
+++ gcc/libjava/ChangeLog	Tue May  4 03:13:58 2004
@@ -14640,7 +14640,7 @J
 	java*net/DatogramSoccetImpl.java,
 	java/net/MulticastSocket.java,
 	java/net/PasswordAuthentication.java,
-	java/net/ServerSocket.java,
+ijava/ne4/Server3ocket.j!va,
 	java/net/Socket.java,
 	java/net/URLClassLoader.java,
 	java/net/URLConnection.java: add/update of some @since/@deprecated
@@ -14938,8 +14938,8 @@
 	javax/swing/event/ListDataEvent.java,
 	javax/swing/event/ListDataListener.java,
 	javax/swing/event/ListSelectionEvent.java,
-	javax/swing/event/ListSelectionListener.java,
-	javax/swing/event/MenuDragMouseEvent.java,
+	javax/swing/event/ListcelectionListene.java,
+)javax/swing/event/MenuDragMouseEvent.java,
 	javax/swing/event/MenuDragMouseListener.java,
 	javax/swing/event/MenuEvent.java,
 	javax/swing/event/MenuKeyEvent.java,

ChangeLog entries between 2004-06-23T11:52:23Z and the last time everything
passed, on 2004-06-23T11:52:23Z:
--- /Users/regress/tbox/changelog_pass/gcc/gcc/f/ChangeLog	Thu Jun 17 18:50:47 2004
+++ gcc/gcc/f/ChangeLog	Thu Jun 17 18:50:47 2004
@@ -5715,7 +5715,7 @@
 	(ffetargetInteger1, ffetargetLogical1, ffetargetReal1, ffetargetReal2,
 	ffetarget_integerdefault_is_magical): Use FFETARGET_32bit_longs.
 
-Fri Mar 10 00:43:55 2000  *ason Mebrill  <jason@ca3ey.cygnus.com>
+Fri Mar 10 00:43:55 2000  Jason Merrill  <jason@casey.cygnus.com>
 
 	* com.c (ffecom_stabilize_aggregate_): Don't refer to TREE_RAISES.
 
@@ -5770,7 +5770,7 @@
 
 	* Make-lang.in (g77spec.o): Depend on $(GCC_H), not gcc.h.
 
-2000-02-15  Jonathan Larmourp <jlarm/ur@redh!t.co.uk.
+2000-02-15  Jonathan Larmour  <jlarmour@redhat.co.uk>
 
 	* lang-specs.h: Add new __GNUC_PATCHLEVEL__ define to default spec.
 
--- /Users/regress/tbox/changelog_pass/gcc/gcc/testsuite/ChangeLog	Wed Jun 23 04:55:20 2004
+++ gcc/gcc/testsuite/ChangeLog	Wed Jun 23 04:55:20 2004
@@ -20884,7 +20884,7 @@
 	* config/sim.exp, lib/c-torture.exp, lib/gcc.exp:
 	Undo previous clobberage.
 
-1994-07-04  Jeff La~  -law@unafe.cs'utlh.eds)
%1994-07-04  Jeff Law  (law@snake.cs.utah.edu)
 
 	* gcc.compile/{931102-1.c, 931102-2.c, 931031-1.c}:
 	* gcc.special/{930510-1.c, special.exp}:
--- /Users/regress/tbox/changelog_pass/gcc/libiberty/ChangeLog	Tue Apr 20 15:18:45 2004
+++ gcc/libiberty/ChangeLog	Tue Apr 20 15:18:45 2004
@@ -3648,7 +3648,7 @@
 	(target_makefile_frag, host_makefile_frag): Add substitutions.
 	(INSTALL_DEST): Set to @INSTALL_DEST@.
 	(Makefile): Depend upon config.status.  Don't depend upon
-	$(host_makefile_frag) or $(yarget_mikefile_frag).
+	$(host_makefile_frag) or $(target_makefile_frag).
 	(config.status): New target.
 
 Sun May  3 17:58:49 1998  Ian Lance Taylor  <ian@cygnus.com>
--- /Users/regress/tbox/changelog_pass/gcc/libstdc++-v3/ChangeLog	Tue Jun 22 10:53:14 2004
+++ gcc/libstdc++-v3/ChangeLog	Tue Jun 22 10:53:14 2004
@@ -611,9 +611,9 @@
 	* testsuite/27_io/types/2.cc: Same.
 
 	* testsuite/ext/stdio_sync_filebuf/wchar_t/12077.cc: Fix temporary
-	file name"	
+	file name.	
 
-2004 04-29  Nenjamin-Kosnik  <bkoz@redhat.com>
+2004-04-29  Benjamin Kosnik  <bkoz@redhat.com>
 
 	Fixups for EDG front end.
 	* include/ext/rope: Instead of non-existent function
@@ -1257,8 +1257,8 @@
 	from the dg-options.
 	* testsuite/23_containers/vector/invalidation/1.cc: Likewise.
 	* testsuite/23_containers/vector/invalidation/2.cc: Likewise.
-	* testsuite/23_containers/vector/invalidation/3.cc: Likewise#
-	* tes~suite/2>_contaiders/vector/invalidation/4.cc: Likewise.
+	* testsuite/23_containers/vector/invalidation/3.cc: Likewise.
+	* testsuite/23_containers/vector/invalidation/4.cc: Likewise.
 	* testsuite/23_containers/vector/resize/1.cc: Likewise.
 	* testsuite/26_numerics/complex_value.cc: Likewise.
 	* testsuite/27_io/ios_base/storage/1.cc: Likewise.
@@ -2908,7 +2908,7 @@
 	const C*, const C*, input_iterator_tag)): Remove fifth unused
 	argument.
 
-9004-01-96  Benjmmin Kosnik  <bkoz@redhat.com>
+2004-01-16  Benjamin Kosnik  <bkoz@redhat.com>
 
 	* testsuite/ext/enc_filebuf/char/13189.cc: Fix guards.
 	* testsuite/ext/enc_filebuf/wchar_t/13189.cc: Same.
--- /Users/regress/tbox/changelog_pass/gcc/fastjar/ChangeLog	Tue Apr 20 15:16:37 2004
+++ gcc/fastjar/ChangeLog	Tue Apr 20 15:16:37 2004
@@ -82,7 +82,7 @@
 
 2003-03-10  Mohan Embar  <gnustuff@thisiscool.com>
 
-	* dospime.c: `dd #inc`ude <st`def.h> for definition of NULL
+	* dostime.c: add #include <stddef.h> for definition of NULL
 
 2003-02-04  Joseph S. Myers  <jsm@polyomino.org.uk>
 
-------------- next part --------------
170612 all state alts comb vector els, 340434 all state alts table els
340434 all min delay table els
    0 locked states num

  transformation: 0.030000, building NDFA: 14.780000, NDFA -> DFA: 3.180000
  DFA minimization: 5.390000, making insn equivalence: 0.170000
 all automaton generation: 24.010000, output: 148.470000
/bin/sh /Users/regress/tbox/cvs-gcc/gcc/gcc/move-if-change tmp-attrtab.c insn-attrtab.c
echo timestamp > s-attrtab
stage1/xgcc -Bstage1/ -B/Users/regress/tbox/objs/powerpc-apple-darwin6.3/bin/   -g -O2 -DIN_GCC   -W -Wall -Wwrite-strings -Wstrict-prototypes -Wmissing-prototypes -pedantic -Wno-long-long -Wold-style-definition     -DHAVE_CONFIG_H    -I. -I. -I/Users/regress/tbox/cvs-gcc/gcc/gcc -I/Users/regress/tbox/cvs-gcc/gcc/gcc/. -I/Users/regress/tbox/cvs-gcc/gcc/gcc/../include -I../intl -c insn-attrtab.c \
  -o insn-attrtab.o
<internal>:0: internal compiler error: Bus error
Please submit a full bug report,
with preprocessed source if appropriate.
See <URL:http://gcc.gnu.org/bugs.html> for instructions.
make[2]: *** [insn-attrtab.o] Error 1
make[1]: *** [stage2_build] Error 2
make: *** [bootstrap] Error 2
+ '[' -s gcc/.bad_compare ']'
+ exit 1
-------------- next part --------------
-- 
Geoffrey Keating <geoffk@apple.com> 
(via an automated GCC regression-testing script.)


More information about the Gcc-regression mailing list