GCC build failed for 3 targets with your patch on 2002-07-03T10:00:01Z.

GCC regression checker regress@redhat.com
Wed Jul 3 03:22:00 GMT 2002


With your recent patch, GCC does not compile on:
 powerpc-eabisim mips-elf native
Attached is build output for those targets.

The last time the regression tests were run, GCC did not compile either,
so the problem might not be caused by your patch.

For more information, see <http://people.redhat.com/geoffk/gcc-regression/>.
-------------- next part --------------
ChangeLog entries since last run on 2002-07-03T06:30:02Z:
--- /maat/heart/tbox/changelog_mail/gcc/gcc/ChangeLog	Tue Jul  2 19:45:31 2002
+++ gcc/gcc/ChangeLog	Wed Jul  3 03:00:15 2002
@@ -1,3 +1,30 @@
+Wed Jul  3 10:24:16 2002  J"orn Rennecke <joern.rennecke@superh.com>
+
+	* optabs.c (expand_vector_binop): Don't store using a SUBREG smaller
+	than UNITS_PER_WORD, unless this is little endian and the first unit
+	in this word.  Let extract_bit_field decide how to load an element.
+	Force arguments to matching mode.
+	(expand_vector_unop): Likewise.
+
+	* simplify-rtx.c (simplify_subreg): Don't assume that all vectors
+	consist of word_mode elements.
+	* c-typeck.c (build_binary_op): Allow vector types for BIT_AND_EXPR,
+	BIT_ANDTC_EXPR, BIT_IOR_EXPR and BIT_XOR_EXPR.
+	(build_unary_op): Allow vector types for BIT_NOT_EPR.
+	* emit-rtl.c (gen_lowpart_common): Use simplify_gen_subreg for
+	CONST_VECTOR.
+	* optabs.c (expand_vector_binop): Try to perform operation in
+	smaller vector modes with same inner size.  Add handling of AND, IOR
+	and XOR.  Reject expansion to inner-mode sized scalars when using
+	OPTAB_DIRECT.  Use simplify_gen_subreg on constants.
+	(expand_vector_unop): Try to perform operation in smaller vector
+	modes with same inner size.  Add handling of one's complement.
+	When there is no vector negate operation, try a vector subtract
+	operation.  Use simplify_gen_subreg on constants.
+	* simplify-rtx.c (simplify_subreg): Add capability to convert vector
+	constants into smaller vectors with same inner mode, and to
+	integer CONST_DOUBLEs.
+
 2002-07-02  Kaveh R. Ghazi  <ghazi@caip.rutgers.edu>
 
 	* c-parse.in (parsing_iso_function_signature): New variable.
--- /maat/heart/tbox/changelog_mail/gcc/gcc/testsuite/ChangeLog	Tue Jul  2 19:45:43 2002
+++ gcc/gcc/testsuite/ChangeLog	Wed Jul  3 03:00:21 2002
@@ -1,3 +1,8 @@
+Wed Jul  3 10:25:41 2002  J"orn Rennecke <joern.rennecke@superh.com>
+
+	* gcc.c-torture/execute/simd-1.c (main): Also test &, |, ^, ~.
+	* gcc.c-torture/execute/simd-2.c (main): Likewise.
+
 2002-07-02  Kaveh R. Ghazi  <ghazi@caip.rutgers.edu>
 
 	* gcc.dg/cpp/tr-warn2.c: Use traditional C style function definitions.

ChangeLog entries between 2002-07-03T06:30:02Z and the last time everything
passed, on 2002-07-02T08:09:54Z:
--- /maat/heart/tbox/changelog_pass/gcc/ChangeLog	Mon Jul  1 18:14:38 2002
+++ gcc/ChangeLog	Tue Jul  2 20:14:23 2002
@@ -1,3 +1,11 @@
+2002-07-02  Nathanael Nerode  <neroden@gcc.gnu.org>
+
+	* configure.in: Rearrange target Makefile fragment collection.
+
+	* Makefile.in: Don't try to build gdbtest, tgas, ispell, inet, or
+	cvs[src].
+	* configure.in: Ditto.
+
 2002-07-01  Matt Kraai  <kraai@alumni.cmu.edu>
 
 	* MAINTAINERS (Write After Approval): Update my e-mail address.
@@ -8,7 +16,7 @@
 
 	* Makefile.in (all-cgen): Remove; runs from its source directory.
 	(check-cgen, install-cgen, clean-cgen): Likewise.
-	(all-opcodes): No not depend on all-cgen.
+	(all-opcodes): Do not depend on all-cgen.
 	(all-sim): Likewise.
 
 2002-07-01  Nathanael Nerode <neroden@gcc.gnu.org>
--- /maat/heart/tbox/changelog_pass/gcc/gcc/ChangeLog	Mon Jul  1 21:43:01 2002
+++ gcc/gcc/ChangeLog	Tue Jul  2 19:45:31 2002
@@ -1,3 +1,69 @@
+2002-07-02  Kaveh R. Ghazi  <ghazi@caip.rutgers.edu>
+
+	* c-parse.in (parsing_iso_function_signature): New variable.
+	(extdef_1): New, copied from...
+	(extdef): ... here.  Reset parsing_iso_function_signature.
+	(old_style_parm_decls):  Reset parsing_iso_function_signature.
+	(old_style_parm_decls_1): New, copied from old_style_parm_decls.
+	Warn about ISO C style function definitions.
+	(nested_function, notype_nested_function): Reset
+	parsing_iso_function_signature.
+	(parmlist_2): Set parsing_iso_function_signature.
+
+	* doc/invoke.texi (-Wtraditional): Document new behavior.
+
+2002-07-02  Chris Demetriou  <cgd@broadcom.com>
+
+	* config.gcc (mips*el-*-*): Use tm_defines to set
+	TARGET_ENDIAN_DEFAULT, rather than including mips/little.h.
+	* config/mips/little.h: Remove.
+
+2002-07-02 Devang Patel <dpatel@apple.com>
+
+	* objc/objc-act.c (adjust_type_for_id_default): Do not allow an
+	object as parameter. Prevent something like 'NSObject' to be
+	used as the type for a method argument.
+
+2002-07-03  Neil Booth  <neil@daikokuya.co.uk>
+
+	* cpptrad.c: Update comment.
+
+2002-07-02  Neil Booth  <neil@daikokuya.co.uk>
+	
+	* doc/cpp.texi: Update for traditional preprocessing changes.
+	* goc/cppopts.texi: Similarly.
+
+2002-07-02  Ziemowit Laski  <zlaski@apple.com>
+
+	* c-parse.in (designator): Enable designated initializers if ObjC.
+	(objcmessageexpr): Remove references to objc_receiver_context.
+	* objc/objc-act.h (objc_receiver_context): Remove decl.
+	* objc/objc-act.c (objc_receiver_context): Remove.
+	(lookup_objc_ivar): Test objc_method_context instead of
+	objc_receiver_context.
+
+Tue Jul  2 18:45:45 2002  J"orn Rennecke <joern.rennecke@superh.com>
+
+	* sh.c (print_operand, case 'N'): Allow zero vector.
+	(arith_reg_or_0_operand): Likewise.
+	(zero_vec_operand): Check for CONST_VECTOR, not PARALLEL.
+	* sh.h (CONST_COSTS): 0 has 0 cost.  Check OUTER_CODE for 
+	IOR, XOR, PLUS and SET and take their respective constant
+	ranges into account.
+	(PREDICATE_CODES, arith_reg_or_0_operand): Can be CONST_VECTOR.
+	* sh.md (subdi3, subdi3_media): Allow zero operand.
+	(movv8qi_i+3): Only vector that is not split is the zero vector.
+	Fix operand 3 to simplify_subreg.
+	(movv2si_i): Split alternative 1.
+	(mshfhi_l_di_rev+1): New splitter.
+
+2002-07-02  Neil Booth  <neil@daikokuya.co.uk>
+
+	PR preprocessor/7029
+	* cppinit.c (cpp_handle_option):  Suppress warnings with an
+	implicit "-w" for "-M" and "-MM".
+	* doc/cppopts.texi: Update.
+
 2002-07-01  Roger Sayle  <roger@eyesopen.com>
 
 	* config/sh/sh.c (sh_media_init_builtins): Change use of poisoned
--- /maat/heart/tbox/changelog_pass/gcc/gcc/cp/ChangeLog	Mon Jul  1 21:43:05 2002
+++ gcc/gcc/cp/ChangeLog	Tue Jul  2 09:25:27 2002
@@ -1,3 +1,16 @@
+2002-07-02  Kriang Lerdsuwanakij  <lerdsuwa@users.sourceforge.net>
+
+	* typeck2.c (cxx_incomplete_type_diagnostic): Fix typo caused
+	by CVS conflict in my last patch.
+
+2002-07-02  Kriang Lerdsuwanakij  <lerdsuwa@users.sourceforge.net>
+
+	PR c++/6716
+	* pt.c (can_complete_type_without_circularity): New function.
+	(instantiate_class_template): Use it.
+	* typeck2.c (cxx_incomplete_type_diagnostic): Improve error
+	message due to incomplete fields.
+
 2002-07-01  Mark Mitchell  <mark@codesourcery.com>
 
 	PR c++/7112
--- /maat/heart/tbox/changelog_pass/gcc/gcc/testsuite/ChangeLog	Mon Jul  1 21:43:14 2002
+++ gcc/gcc/testsuite/ChangeLog	Tue Jul  2 19:45:43 2002
@@ -1,3 +1,45 @@
+2002-07-02  Kaveh R. Ghazi  <ghazi@caip.rutgers.edu>
+
+	* gcc.dg/cpp/tr-warn2.c: Use traditional C style function definitions.
+	* gcc.dg/wtr-aggr-init-1.c: Likewise.
+	* gcc.dg/wtr-conversion-1.c: Likewise.
+	* gcc.dg/wtr-escape-1.c: Likewise.
+	* gcc.dg/wtr-int-type-1.c: Likewise.
+	* gcc.dg/wtr-label-1.c: Likewise.
+	* gcc.dg/wtr-static-1.c: Likewise.
+	* gcc.dg/wtr-strcat-1.c: Likewise.
+	* gcc.dg/wtr-suffix-1.c: Likewise.
+	* gcc.dg/wtr-switch-1.c: Likewise.
+	* gcc.dg/wtr-unary-plus-1.c: Likewise.
+	* gcc.dg/wtr-union-init-1.c: Likewise.
+	* gcc.dg/wtr-union-init-2.c: Likewise.
+	* gcc.dg/wtr-union-init-3.c: Likewise.
+
+	* gcc.dg/wtr-func-def-1.c: New test.
+
+2002-07-02 Devang Patel <dpatel@apple.com>
+
+	* objc.dg/param-1.m: New test.
+
+2002-07-03  Neil Booth  <neil@daikokuya.co.uk>
+
+	* gcc.dg/cpp/trad/directive.c: Add test.
+	* gcc.dg/cpp/trad/macroargs.c: Add test.
+	* gcc.dg/cpp/trad/recurse-3.c: Add tests.
+
+2002-07-02  Neil Booth  <neil@daikokuya.co.uk>
+
+	* gcc.dg/cpp/cmdlne-M.c: New test.
+
+2002-07-02  Ziemowit Laski  <zlaski@apple.com>
+
+	* objc.dg/desig-init-1.m: New test.
+
+2002-07-02  Kriang Lerdsuwanakij  <lerdsuwa@users.sourceforge.net>
+
+	PR c++/6716
+	* g++.dg/template/instantiate1.C: New test.
+
 2002-07-01  Mark Mitchell  <mark@codesourcery.com>
 
 	PR c++/7112
--- /maat/heart/tbox/changelog_pass/gcc/libstdc++-v3/ChangeLog	Tue Jul  2 01:12:52 2002
+++ gcc/libstdc++-v3/ChangeLog	Tue Jul  2 23:30:22 2002
@@ -1,3 +1,23 @@
+2002-07-02  Benjamin Kosnik  <bkoz@redhat.com>
+
+	PR libstdc++/6410
+	* include/bits/locale_facets.h (moneypunct::moneypunct): Add const
+	char* name parameter.
+	* config/locale/gnu/monetary_members.cc: Use it.
+	* config/locale/generic/monetary_members.cc: Same.
+	* src/localename.cc (_Impl::_Impl(const char*, size_t)): Use it.
+
+	* include/backward/strstream.h: Update date.
+
+2002-07-02  Paolo Carlini  <pcarlini@unitus.it>
+
+	PR libstdc++/6642
+	* include/bits/stl_iterator.h
+	(__normal_iterator::operator-(const __normal_iterator&)):
+	Make non-member, as already happens for the comparison
+	operators in accord with DR179 (Ready).
+	* testsuite/24_iterators/iterator.cc: Add test from the PR.
+
 2002-07-02  Phil Edwards  <pme@gcc.gnu.org>
 
 	PR libstdc++/7173
--- /maat/heart/tbox/changelog_pass/gcc/libjava/ChangeLog	Mon Jul  1 21:43:38 2002
+++ gcc/libjava/ChangeLog	Tue Jul  2 13:02:44 2002
@@ -1,3 +1,13 @@
+2002-07-02  Tom Tromey  <tromey@redhat.com>
+            David Hovemeyer  <daveho@cs.umd.edu>
+
+	* java/text/ChoiceFormat.java
+	(format(double,StringBuffer,FieldPosition)): Fix fencepost error
+	in check loop.
+	* java/text/MessageFormat.java
+	(format(Object[],StringBuffer,FieldPosition): Pass all arguments
+	to MessageFormat.
+
 2002-07-01  Tom Tromey  <tromey@redhat.com>
 
 	* javax/naming/spi/NamingManager.java (getPlusPath): Don't create
--- /maat/heart/tbox/changelog_pass/gcc/libjava/testsuite/ChangeLog	Sun Jun 23 22:52:29 2002
+++ gcc/libjava/testsuite/ChangeLog	Tue Jul  2 11:30:33 2002
@@ -1,3 +1,10 @@
+2002-07-02  Andrew Haley  <aph@redhat.com>
+
+	* libjava.lang/inline.java: New file.
+	* libjava.lang/inline.out: Likewise.
+
+	* libjava.lang/Array_3.java: Add another case.
+
 2002-06-23  Tom Tromey  <tromey@redhat.com>
 
 	* Makefile.in: Rebuilt.
-------------- next part --------------
/maat/heart/tbox/cvs-gcc/gcc/gcc/cp/dump.c:224: warning: signed and unsigned type in conditional expression
gcc -c -DIN_GCC -DCROSS_COMPILE   -g -O2 -W -Wall -Wwrite-strings -Wstrict-prototypes -Wmissing-prototypes   -DHAVE_CONFIG_H    -I. -Icp -I/maat/heart/tbox/cvs-gcc/gcc/gcc -I/maat/heart/tbox/cvs-gcc/gcc/gcc/cp -I/maat/heart/tbox/cvs-gcc/gcc/gcc/config -I/maat/heart/tbox/cvs-gcc/gcc/gcc/../include /maat/heart/tbox/cvs-gcc/gcc/gcc/cp/optimize.c -o cp/optimize.o
gcc -c -DIN_GCC -DCROSS_COMPILE   -g -O2 -W -Wall -Wwrite-strings -Wstrict-prototypes -Wmissing-prototypes   -DHAVE_CONFIG_H    -I. -Icp -I/maat/heart/tbox/cvs-gcc/gcc/gcc -I/maat/heart/tbox/cvs-gcc/gcc/gcc/cp -I/maat/heart/tbox/cvs-gcc/gcc/gcc/config -I/maat/heart/tbox/cvs-gcc/gcc/gcc/../include /maat/heart/tbox/cvs-gcc/gcc/gcc/cp/mangle.c -o cp/mangle.o
/maat/heart/tbox/cvs-gcc/gcc/gcc/cp/mangle.c: In function `write_mangled_name':
/maat/heart/tbox/cvs-gcc/gcc/gcc/cp/mangle.c:617: warning: signed and unsigned type in conditional expression
/maat/heart/tbox/cvs-gcc/gcc/gcc/cp/mangle.c: In function `write_encoding':
/maat/heart/tbox/cvs-gcc/gcc/gcc/cp/mangle.c:642: warning: signed and unsigned type in conditional expression
/maat/heart/tbox/cvs-gcc/gcc/gcc/cp/mangle.c: In function `mangle_decl_string':
/maat/heart/tbox/cvs-gcc/gcc/gcc/cp/mangle.c:2233: warning: signed and unsigned type in conditional expression
/maat/heart/tbox/cvs-gcc/gcc/gcc/cp/mangle.c:2241: warning: signed and unsigned type in conditional expression
gcc -c -DIN_GCC -DCROSS_COMPILE   -g -O2 -W -Wall -Wwrite-strings -Wstrict-prototypes -Wmissing-prototypes   -DHAVE_CONFIG_H    -I. -Icp -I/maat/heart/tbox/cvs-gcc/gcc/gcc -I/maat/heart/tbox/cvs-gcc/gcc/gcc/cp -I/maat/heart/tbox/cvs-gcc/gcc/gcc/config -I/maat/heart/tbox/cvs-gcc/gcc/gcc/../include /maat/heart/tbox/cvs-gcc/gcc/gcc/cp/cp-lang.c -o cp/cp-lang.o
gcc -DIN_GCC -DCROSS_COMPILE   -g -O2 -W -Wall -Wwrite-strings -Wstrict-prototypes -Wmissing-prototypes -Wtraditional -pedantic -Wno-long-long  -DHAVE_CONFIG_H  -o cc1plus \
      cp/call.o cp/decl.o cp/expr.o cp/pt.o cp/typeck2.o cp/class.o cp/decl2.o cp/error.o cp/lex.o cp/parse.o cp/ptree.o cp/rtti.o cp/spew.o cp/typeck.o cp/cvt.o cp/except.o cp/friend.o cp/init.o cp/method.o cp/search.o cp/semantics.o cp/tree.o cp/repo.o cp/dump.o cp/optimize.o cp/mangle.o cp/cp-lang.o attribs.o c-common.o c-format.o c-pragma.o c-semantics.o c-lex.o rs6000-c.o main.o libbackend.a libcpp.a   ../libiberty/libiberty.a
cp/pt.o: In function `instantiate_class_template':
/maat/heart/tbox/cvs-gcc/gcc/gcc/cp/pt.c:5254: undefined reference to `incomplete_type_error'
collect2: ld returned 1 exit status
make[1]: *** [cc1plus] Error 1
make[1]: Leaving directory `/maat/heart/tbox/powerpc-eabisim/build/gcc'
make: *** [all-gcc] Error 2
+ exit 1
-------------- next part --------------
/maat/heart/tbox/cvs-gcc/gcc/gcc/cp/dump.c:224: warning: signed and unsigned type in conditional expression
gcc -c -DIN_GCC -DCROSS_COMPILE   -g -O2 -W -Wall -Wwrite-strings -Wstrict-prototypes -Wmissing-prototypes   -DHAVE_CONFIG_H    -I. -Icp -I/maat/heart/tbox/cvs-gcc/gcc/gcc -I/maat/heart/tbox/cvs-gcc/gcc/gcc/cp -I/maat/heart/tbox/cvs-gcc/gcc/gcc/config -I/maat/heart/tbox/cvs-gcc/gcc/gcc/../include /maat/heart/tbox/cvs-gcc/gcc/gcc/cp/optimize.c -o cp/optimize.o
gcc -c -DIN_GCC -DCROSS_COMPILE   -g -O2 -W -Wall -Wwrite-strings -Wstrict-prototypes -Wmissing-prototypes   -DHAVE_CONFIG_H    -I. -Icp -I/maat/heart/tbox/cvs-gcc/gcc/gcc -I/maat/heart/tbox/cvs-gcc/gcc/gcc/cp -I/maat/heart/tbox/cvs-gcc/gcc/gcc/config -I/maat/heart/tbox/cvs-gcc/gcc/gcc/../include /maat/heart/tbox/cvs-gcc/gcc/gcc/cp/mangle.c -o cp/mangle.o
/maat/heart/tbox/cvs-gcc/gcc/gcc/cp/mangle.c: In function `write_mangled_name':
/maat/heart/tbox/cvs-gcc/gcc/gcc/cp/mangle.c:617: warning: signed and unsigned type in conditional expression
/maat/heart/tbox/cvs-gcc/gcc/gcc/cp/mangle.c: In function `write_encoding':
/maat/heart/tbox/cvs-gcc/gcc/gcc/cp/mangle.c:642: warning: signed and unsigned type in conditional expression
/maat/heart/tbox/cvs-gcc/gcc/gcc/cp/mangle.c: In function `mangle_decl_string':
/maat/heart/tbox/cvs-gcc/gcc/gcc/cp/mangle.c:2233: warning: signed and unsigned type in conditional expression
/maat/heart/tbox/cvs-gcc/gcc/gcc/cp/mangle.c:2241: warning: signed and unsigned type in conditional expression
gcc -c -DIN_GCC -DCROSS_COMPILE   -g -O2 -W -Wall -Wwrite-strings -Wstrict-prototypes -Wmissing-prototypes   -DHAVE_CONFIG_H    -I. -Icp -I/maat/heart/tbox/cvs-gcc/gcc/gcc -I/maat/heart/tbox/cvs-gcc/gcc/gcc/cp -I/maat/heart/tbox/cvs-gcc/gcc/gcc/config -I/maat/heart/tbox/cvs-gcc/gcc/gcc/../include /maat/heart/tbox/cvs-gcc/gcc/gcc/cp/cp-lang.c -o cp/cp-lang.o
gcc -DIN_GCC -DCROSS_COMPILE   -g -O2 -W -Wall -Wwrite-strings -Wstrict-prototypes -Wmissing-prototypes -Wtraditional -pedantic -Wno-long-long  -DHAVE_CONFIG_H  -o cc1plus \
      cp/call.o cp/decl.o cp/expr.o cp/pt.o cp/typeck2.o cp/class.o cp/decl2.o cp/error.o cp/lex.o cp/parse.o cp/ptree.o cp/rtti.o cp/spew.o cp/typeck.o cp/cvt.o cp/except.o cp/friend.o cp/init.o cp/method.o cp/search.o cp/semantics.o cp/tree.o cp/repo.o cp/dump.o cp/optimize.o cp/mangle.o cp/cp-lang.o attribs.o c-common.o c-format.o c-pragma.o c-semantics.o c-lex.o  main.o libbackend.a libcpp.a   ../libiberty/libiberty.a
cp/pt.o: In function `instantiate_class_template':
/maat/heart/tbox/cvs-gcc/gcc/gcc/cp/pt.c:5256: undefined reference to `incomplete_type_error'
collect2: ld returned 1 exit status
make[1]: *** [cc1plus] Error 1
make[1]: Leaving directory `/anubis/mummy/tbox/mips-elf/build/gcc'
make: *** [all-gcc] Error 2
+ exit 1
-------------- next part --------------
stage1/xgcc -Bstage1/ -B/maat/heart/tbox/objs/i686-pc-linux-gnu/bin/ -c -DIN_GCC    -g -O2 -W -Wall -Wwrite-strings -Wstrict-prototypes -Wmissing-prototypes   -DHAVE_CONFIG_H    -I. -Icp -I/maat/heart/tbox/cvs-gcc/gcc/gcc -I/maat/heart/tbox/cvs-gcc/gcc/gcc/cp -I/maat/heart/tbox/cvs-gcc/gcc/gcc/config -I/maat/heart/tbox/cvs-gcc/gcc/gcc/../include /maat/heart/tbox/cvs-gcc/gcc/gcc/cp/search.c -o cp/search.o
stage1/xgcc -Bstage1/ -B/maat/heart/tbox/objs/i686-pc-linux-gnu/bin/ -c -DIN_GCC    -g -O2 -W -Wall -Wwrite-strings -Wstrict-prototypes -Wmissing-prototypes   -DHAVE_CONFIG_H    -I. -Icp -I/maat/heart/tbox/cvs-gcc/gcc/gcc -I/maat/heart/tbox/cvs-gcc/gcc/gcc/cp -I/maat/heart/tbox/cvs-gcc/gcc/gcc/config -I/maat/heart/tbox/cvs-gcc/gcc/gcc/../include /maat/heart/tbox/cvs-gcc/gcc/gcc/cp/semantics.c -o cp/semantics.o
stage1/xgcc -Bstage1/ -B/maat/heart/tbox/objs/i686-pc-linux-gnu/bin/ -c -DIN_GCC    -g -O2 -W -Wall -Wwrite-strings -Wstrict-prototypes -Wmissing-prototypes   -DHAVE_CONFIG_H    -I. -Icp -I/maat/heart/tbox/cvs-gcc/gcc/gcc -I/maat/heart/tbox/cvs-gcc/gcc/gcc/cp -I/maat/heart/tbox/cvs-gcc/gcc/gcc/config -I/maat/heart/tbox/cvs-gcc/gcc/gcc/../include /maat/heart/tbox/cvs-gcc/gcc/gcc/cp/tree.c -o cp/tree.o
stage1/xgcc -Bstage1/ -B/maat/heart/tbox/objs/i686-pc-linux-gnu/bin/ -c -DIN_GCC    -g -O2 -W -Wall -Wwrite-strings -Wstrict-prototypes -Wmissing-prototypes   -DHAVE_CONFIG_H    -I. -Icp -I/maat/heart/tbox/cvs-gcc/gcc/gcc -I/maat/heart/tbox/cvs-gcc/gcc/gcc/cp -I/maat/heart/tbox/cvs-gcc/gcc/gcc/config -I/maat/heart/tbox/cvs-gcc/gcc/gcc/../include /maat/heart/tbox/cvs-gcc/gcc/gcc/cp/repo.c -o cp/repo.o
stage1/xgcc -Bstage1/ -B/maat/heart/tbox/objs/i686-pc-linux-gnu/bin/ -c -DIN_GCC    -g -O2 -W -Wall -Wwrite-strings -Wstrict-prototypes -Wmissing-prototypes   -DHAVE_CONFIG_H    -I. -Icp -I/maat/heart/tbox/cvs-gcc/gcc/gcc -I/maat/heart/tbox/cvs-gcc/gcc/gcc/cp -I/maat/heart/tbox/cvs-gcc/gcc/gcc/config -I/maat/heart/tbox/cvs-gcc/gcc/gcc/../include /maat/heart/tbox/cvs-gcc/gcc/gcc/cp/dump.c -o cp/dump.o
stage1/xgcc -Bstage1/ -B/maat/heart/tbox/objs/i686-pc-linux-gnu/bin/ -c -DIN_GCC    -g -O2 -W -Wall -Wwrite-strings -Wstrict-prototypes -Wmissing-prototypes   -DHAVE_CONFIG_H    -I. -Icp -I/maat/heart/tbox/cvs-gcc/gcc/gcc -I/maat/heart/tbox/cvs-gcc/gcc/gcc/cp -I/maat/heart/tbox/cvs-gcc/gcc/gcc/config -I/maat/heart/tbox/cvs-gcc/gcc/gcc/../include /maat/heart/tbox/cvs-gcc/gcc/gcc/cp/optimize.c -o cp/optimize.o
stage1/xgcc -Bstage1/ -B/maat/heart/tbox/objs/i686-pc-linux-gnu/bin/ -c -DIN_GCC    -g -O2 -W -Wall -Wwrite-strings -Wstrict-prototypes -Wmissing-prototypes   -DHAVE_CONFIG_H    -I. -Icp -I/maat/heart/tbox/cvs-gcc/gcc/gcc -I/maat/heart/tbox/cvs-gcc/gcc/gcc/cp -I/maat/heart/tbox/cvs-gcc/gcc/gcc/config -I/maat/heart/tbox/cvs-gcc/gcc/gcc/../include /maat/heart/tbox/cvs-gcc/gcc/gcc/cp/mangle.c -o cp/mangle.o
stage1/xgcc -Bstage1/ -B/maat/heart/tbox/objs/i686-pc-linux-gnu/bin/ -c -DIN_GCC    -g -O2 -W -Wall -Wwrite-strings -Wstrict-prototypes -Wmissing-prototypes   -DHAVE_CONFIG_H    -I. -Icp -I/maat/heart/tbox/cvs-gcc/gcc/gcc -I/maat/heart/tbox/cvs-gcc/gcc/gcc/cp -I/maat/heart/tbox/cvs-gcc/gcc/gcc/config -I/maat/heart/tbox/cvs-gcc/gcc/gcc/../include /maat/heart/tbox/cvs-gcc/gcc/gcc/cp/cp-lang.c -o cp/cp-lang.o
stage1/xgcc -Bstage1/ -B/maat/heart/tbox/objs/i686-pc-linux-gnu/bin/ -DIN_GCC    -g -O2 -W -Wall -Wwrite-strings -Wstrict-prototypes -Wmissing-prototypes -Wtraditional -pedantic -Wno-long-long  -DHAVE_CONFIG_H  -o cc1plus \
      cp/call.o cp/decl.o cp/expr.o cp/pt.o cp/typeck2.o cp/class.o cp/decl2.o cp/error.o cp/lex.o cp/parse.o cp/ptree.o cp/rtti.o cp/spew.o cp/typeck.o cp/cvt.o cp/except.o cp/friend.o cp/init.o cp/method.o cp/search.o cp/semantics.o cp/tree.o cp/repo.o cp/dump.o cp/optimize.o cp/mangle.o cp/cp-lang.o attribs.o c-common.o c-format.o c-pragma.o c-semantics.o c-lex.o  main.o libbackend.a libcpp.a   ../libiberty/libiberty.a
cp/pt.o: In function `instantiate_class_template':
/maat/heart/tbox/cvs-gcc/gcc/gcc/cp/pt.c:5254: undefined reference to `incomplete_type_error'
collect2: ld returned 1 exit status
make[2]: *** [cc1plus] Error 1
make[2]: Leaving directory `/maat/heart/tbox/native/build/gcc'
make[1]: *** [stage2_build] Error 2
make[1]: Leaving directory `/maat/heart/tbox/native/build/gcc'
make: *** [bootstrap] Error 2
+ '[' -s gcc/.bad_compare ']'
+ exit 1
-------------- next part --------------
-- 
Geoffrey Keating <regress@redhat.com> 
(via an automated GCC regression-testing script.)


More information about the Gcc-regression mailing list