GCC build failed for 3 targets with your patch on 2002-04-30T13:45:11Z.

GCC regression checker regress@redhat.com
Tue Apr 30 07:35:00 GMT 2002


With your recent patch, GCC does not compile on:
 powerpc-eabisim mips-elf native
Attached is build output for those targets.

The last time the regression tests were run, GCC did not compile either,
so the problem might not be caused by your patch.

For more information, see <http://people.redhat.com/geoffk/gcc-regression/>.
-------------- next part --------------
ChangeLog entries since last run on 2002-04-30T11:12:33Z:
--- /maat/heart/tbox/changelog_mail/gcc/gcc/ChangeLog	Tue Apr 30 04:12:48 2002
+++ gcc/gcc/ChangeLog	Tue Apr 30 06:45:49 2002
@@ -1,3 +1,8 @@
+2002-04-30  Gerald Pfeifer  <pfeifer@dbai.tuwien.ac.at>
+
+	* doc/contrib.texi (Contributors): Use MIPS instead of Mips and
+	mips.  Add two missing commas.
+
 2002-04-30  Paolo Carlini  <pcarlini@unitus.it>
 
 	* doc/contrib.texi (Contributors): Update Paolo Carlini's

ChangeLog entries between 2002-04-30T11:12:33Z and the last time everything
passed, on 2002-04-30T08:01:14Z:
--- /maat/heart/tbox/changelog_pass/gcc/gcc/ChangeLog	Mon Apr 29 21:51:47 2002
+++ gcc/gcc/ChangeLog	Tue Apr 30 04:12:48 2002
@@ -1,3 +1,8 @@
+2002-04-30  Paolo Carlini  <pcarlini@unitus.it>
+
+	* doc/contrib.texi (Contributors): Update Paolo Carlini's
+	and Benjamin Kosnik's entries.
+
 2002-04-29  David S. Miller  <davem@redhat.com>
 
 	* config/sparc/sparc.h (BRANCH_COST, PREFETCH_BLOCK,
--- /maat/heart/tbox/changelog_pass/gcc/gcc/cp/ChangeLog	Mon Apr 29 10:53:54 2002
+++ gcc/gcc/cp/ChangeLog	Tue Apr 30 04:12:52 2002
@@ -1,3 +1,8 @@
+2002-04-30  Paul Eggert  <eggert@twinsun.com>
+
+	* parse.y (nomods_initdcl0): Do not move stack entries
+	when setting things up as initdcl0_innards expects.
+
 2002-04-29  Jakub Jelinek  <jakub@redhat.com>
 
 	PR c++/6477
--- /maat/heart/tbox/changelog_pass/gcc/libstdc++-v3/ChangeLog	Tue Apr 30 01:02:46 2002
+++ gcc/libstdc++-v3/ChangeLog	Tue Apr 30 04:13:14 2002
@@ -1,3 +1,8 @@
+2002-04-30  Benjamin Kosnik  <bkoz@redhat.com>
+
+	PR libstdc++/6511
+	* config/os/solaris/solaris2.7/bits/ctype_noninline.h: Fix typo.
+
 2002-04-29  Benjamin Kosnik  <bkoz@redhat.com>
 
 	PR libstdc++/5820
-------------- next part --------------
/maat/heart/tbox/powerpc-eabisim/build/powerpc-eabisim/libstdc++-v3/include/bits/locale_facets.h:878: explicit
   specialization in non-namespace scope `void 
   std::numpunct<_CharT>::numpunct() [with _CharT = char]'
/maat/heart/tbox/powerpc-eabisim/build/powerpc-eabisim/libstdc++-v3/include/bits/locale_facets.h: At
   global scope:
/maat/heart/tbox/powerpc-eabisim/build/powerpc-eabisim/libstdc++-v3/include/bits/locale_facets.h: In instantiation of `std::numpunct<char>::collate<char>':
/maat/heart/tbox/powerpc-eabisim/build/powerpc-eabisim/libstdc++-v3/include/bits/locale_facets.h:880:   instantiated from here
/maat/heart/tbox/powerpc-eabisim/build/powerpc-eabisim/libstdc++-v3/include/bits/locale_facets.h:822: internal
   error: Segmentation fault
Please submit a full bug report,
with preprocessed source if appropriate.
See <URL:http://www.gnu.org/software/gcc/bugs.html> for instructions.
make[3]: *** [globals.lo] Error 1
make[3]: Leaving directory `/maat/heart/tbox/powerpc-eabisim/build/powerpc-eabisim/libstdc++-v3/src'
make[2]: *** [all-recursive] Error 1
make[2]: Leaving directory `/maat/heart/tbox/powerpc-eabisim/build/powerpc-eabisim/libstdc++-v3'
make[1]: *** [all-recursive-am] Error 2
make[1]: Leaving directory `/maat/heart/tbox/powerpc-eabisim/build/powerpc-eabisim/libstdc++-v3'
make: *** [all-target-libstdc++-v3] Error 2
+ exit 1
-------------- next part --------------
/anubis/mummy/tbox/mips-elf/build/mips-elf/libstdc++-v3/include/bits/locale_facets.h:878: explicit
   specialization in non-namespace scope `void 
   std::numpunct<_CharT>::numpunct() [with _CharT = char]'
/anubis/mummy/tbox/mips-elf/build/mips-elf/libstdc++-v3/include/bits/locale_facets.h: At
   global scope:
/anubis/mummy/tbox/mips-elf/build/mips-elf/libstdc++-v3/include/bits/locale_facets.h: In instantiation of `std::numpunct<char>::collate<char>':
/anubis/mummy/tbox/mips-elf/build/mips-elf/libstdc++-v3/include/bits/locale_facets.h:880:   instantiated from here
/anubis/mummy/tbox/mips-elf/build/mips-elf/libstdc++-v3/include/bits/locale_facets.h:822: internal
   error: Segmentation fault
Please submit a full bug report,
with preprocessed source if appropriate.
See <URL:http://www.gnu.org/software/gcc/bugs.html> for instructions.
make[3]: *** [globals.lo] Error 1
make[3]: Leaving directory `/anubis/mummy/tbox/mips-elf/build/mips-elf/libstdc++-v3/src'
make[2]: *** [all-recursive] Error 1
make[2]: Leaving directory `/anubis/mummy/tbox/mips-elf/build/mips-elf/libstdc++-v3'
make[1]: *** [all-recursive-am] Error 2
make[1]: Leaving directory `/anubis/mummy/tbox/mips-elf/build/mips-elf/libstdc++-v3'
make: *** [all-target-libstdc++-v3] Error 2
+ exit 1
-------------- next part --------------
/maat/heart/tbox/native/build/i686-pc-linux-gnu/libstdc++-v3/include/bits/locale_facets.h: At
   global scope:
/maat/heart/tbox/native/build/i686-pc-linux-gnu/libstdc++-v3/include/bits/locale_facets.h: In instantiation of `std::numpunct<char>::collate<char>':
/maat/heart/tbox/native/build/i686-pc-linux-gnu/libstdc++-v3/include/bits/locale_facets.h:880:   instantiated from here
/maat/heart/tbox/native/build/i686-pc-linux-gnu/libstdc++-v3/include/bits/locale_facets.h:822: internal
   error: Segmentation fault
Please submit a full bug report,
with preprocessed source if appropriate.
See <URL:http://www.gnu.org/software/gcc/bugs.html> for instructions.
make[4]: *** [globals.lo] Error 1
make[4]: Leaving directory `/maat/heart/tbox/native/build/i686-pc-linux-gnu/libstdc++-v3/src'
make[3]: *** [all-recursive] Error 1
make[3]: Leaving directory `/maat/heart/tbox/native/build/i686-pc-linux-gnu/libstdc++-v3'
make[2]: *** [all-recursive-am] Error 2
make[2]: Leaving directory `/maat/heart/tbox/native/build/i686-pc-linux-gnu/libstdc++-v3'
make[1]: *** [all-target-libstdc++-v3] Error 2
make[1]: Leaving directory `/maat/heart/tbox/native/build'
make: *** [bootstrap] Error 2
+ '[' -s gcc/.bad_compare ']'
+ exit 1
-------------- next part --------------
-- 
Geoffrey Keating <regress@maat.cygnus.com> 
(via an automated GCC regression-testing script.)



More information about the Gcc-regression mailing list