make -k check error

Prathamesh Kulkarni bilbotheelffriend@gmail.com
Fri Jan 17 17:34:00 GMT 2014


Hi, after building gcc-4.9.0 with make bootstrap, i ran
make -k check and got the following error (make bootstrap, make
install work smoothly):

make[3]: [check-parallel-gcc] Error 1 (ignored)
make[4]: *** [check-DEJAGNU] Error 1
make[3]: *** [check-am] Error 2
make[3]: Target `check' not remade because of errors.
make[2]: *** [check-recursive] Error 1
make[2]: Target `check' not remade because of errors.
make[1]: *** [check-target-libjava] Error 2
make[4]: *** [check-DEJAGNU] Error 1
make[3]: *** [check-am] Error 2
make[3]: Target `check' not remade because of errors.
make[2]: *** [check-recursive] Error 1
make[2]: Target `check' not remade because of errors.
make[1]: *** [check-target-libgomp] Error 2
make[1]: Target `check-target' not remade because of errors.
make: *** [do-check] Error 2
make: Target `check' not remade because of errors.

gcc -v:
Using built-in specs.
COLLECT_GCC=./gcc
COLLECT_LTO_WRAPPER=/home/bilbo/gcc-projects/gcc/install/libexec/gcc/x86_64-unknown-linux-gnu/4.9.0/lto-wrapper
Target: x86_64-unknown-linux-gnu
Configured with: ../src/configure --prefix=/home/bilbo/gcc-projects/gcc/install
Thread model: posix
gcc version 4.9.0 20140115 (experimental) (GCC)

Thanks and Regards,
Prathamesh



More information about the Gcc-help mailing list