Failing to build gcc-4.6.3 on Ubuntu 12.04 LTS - problem with _muldi3.o

Jonathan Wakely jwakely.gcc@gmail.com
Thu Sep 5 08:31:00 GMT 2013


On 5 September 2013 08:19, Bill Harris wrote:
> In file included from /usr/include/features.h:389:0,
>                  from /usr/include/stdio.h:28,
>                  from ../../../gcc-4.6.3/libgcc/../gcc/tsystem.h:87,
>                  from ../../../gcc-4.6.3/libgcc/../gcc/libgcc2.c:29:
> /usr/include/gnu/stubs.h:7:27: fatal error: gnu/stubs-32.h: No such
> file or directory
> compilation terminated.
> make[3]: *** [_muldi3.o] Error 1
> make[3]: Leaving directory `/home/bill/gcc-4.6.3-build/i686-pc-linux-gnu/libgcc'
> make[2]: *** [all-stage1-target-libgcc] Error 2
> make[2]: Leaving directory `/home/bill/gcc-4.6.3-build'
> make[1]: *** [stage1-bubble] Error 2
> make[1]: Leaving directory `/home/bill/gcc-4.6.3-build'
> make: *** [all] Error 2
> bill@ubuntu:~/gcc-4.6.3-build$
>
> Can anyone help me?

Please see http://gcc.gnu.org/wiki/FAQ#gnu_stubs-32.h

I think the Ubuntu package is libc-devel-i386



More information about the Gcc-help mailing list