Possibly hindering error when invoking "make"

Brian Lee brian.h.lee.90@gmail.com
Wed Jan 11 06:13:00 GMT 2012


To Whom It May Concern:

I got an error when I tried invoking "make" in order to install GCC 4.6.2. This is some of the output:

Makefile:26: *** missing separator.  Stop.
make[2]: *** [all-stage1-gcc] Error 2
make[1]: *** [stage1-bubble] Error 2
make: *** [all] Error 2

Is this an expected error? Thank you.

Sincerely,

Brian Lee



More information about the Gcc-help mailing list