"../.././gcc/c-common.c", line 2259: invalid token: short_fract_type_no...

kamaraju kusumanchi raju.mailinglists@gmail.com
Thu Nov 13 15:46:00 GMT 2008


>
> This is now http://gcc.gnu.org/bugzilla/show_bug.cgi?id=38100 .
>

The patch posted at http://gcc.gnu.org/bugzilla/show_bug.cgi?id=38100
got me past the gimple_check_failed errors.
Now the compilation stops with

# @multilib_dir@ is not really necessary, but sometimes it has
# more uses than just a directory name.
/bin/bash ../../../../../unZipped/gcc-4.4-20081107/libgcc/../mkinstalldirs
sparcv9
mkdir -p -- sparcv9
/home/kkusuman/software/compileHere/gcc-4.4-20081107/./gcc/xgcc
-B/home/kkusuman/software/compileHere/gcc-4.4-20081107/./gcc/
-B/home/kkusuman/software/myroot/gcc-4.4-20081107/sparc-sun-solaris2.8/bin/
-B/home/kkusuman/software/myroot/gcc-4.4-20081107/sparc-sun-solaris2.8/lib/
-isystem /home/kkusuman/software/myroot/gcc-4.4-20081107/sparc-sun-solaris2.8/include
-isystem /home/kkusuman/software/myroot/gcc-4.4-20081107/sparc-sun-solaris2.8/sys-include
-O2  -O2 -g -DIN_GCC    -Wold-style-definition  -isystem ./include
-fPIC -g -DHAVE_GTHR_DEFAULT -DIN_LIBGCC2 -D__GCC_FLOAT_NOT_NEEDED
-shared -nodefaultlibs -Wl,-h,libgcc_s.so.1 -Wl,-z,text -Wl,-z,defs
-Wl,-M,libgcc.map -o sparcv9/libgcc_s.so.1.tmp -O2 -g -m64 -B./
_muldi3_s.o _negdi2_s.o _lshrdi3_s.o _ashldi3_s.o _ashrdi3_s.o
_cmpdi2_s.o _ucmpdi2_s.o _clear_cache_s.o _enable_execute_stack_s.o
_trampoline_s.o __main_s.o _absvsi2_s.o _absvdi2_s.o _addvsi3_s.o
_addvdi3_s.o _subvsi3_s.o _subvdi3_s.o _mulvsi3_s.o _mulvdi3_s.o
_negvsi2_s.o _negvdi2_s.o _ctors_s.o _ffssi2_s.o _ffsdi2_s.o _clz_s.o
_clzsi2_s.o _clzdi2_s.o _ctzsi2_s.o _ctzdi2_s.o _popcount_tab_s.o
_popcountsi2_s.o _popcountdi2_s.o _paritysi2_s.o _paritydi2_s.o
_powisf2_s.o _powidf2_s.o _powixf2_s.o _powitf2_s.o _mulsc3_s.o
_muldc3_s.o _mulxc3_s.o _multc3_s.o _divsc3_s.o _divdc3_s.o
_divxc3_s.o _divtc3_s.o _bswapsi2_s.o _bswapdi2_s.o _fixunssfsi_s.o
_fixunsdfsi_s.o _fixunsxfsi_s.o _fixsfdi_s.o _fixdfdi_s.o _fixxfdi_s.o
_fixtfdi_s.o _fixunssfdi_s.o _fixunsdfdi_s.o _fixunsxfdi_s.o
_fixunstfdi_s.o _floatdisf_s.o _floatdidf_s.o _floatdixf_s.o
_floatditf_s.o _floatundisf_s.o _floatundidf_s.o _floatundixf_s.o
_floatunditf_s.o _divdi3_s.o _moddi3_s.o _udivdi3_s.o _umoddi3_s.o
_udiv_w_sdiv_s.o _udivmoddi4_s.o unwind-dw2_s.o unwind-dw2-fde_s.o
unwind-sjlj_s.o gthr-gnat_s.o unwind-c_s.o emutls_s.o -lc && rm -f
sparcv9/libgcc_s.so && if [ -f sparcv9/libgcc_s.so.1 ]; then mv -f
sparcv9/libgcc_s.so.1 sparcv9/libgcc_s.so.1.backup; else true; fi &&
mv sparcv9/libgcc_s.so.1.tmp sparcv9/libgcc_s.so.1 && ln -s
libgcc_s.so.1 sparcv9/libgcc_s.so
/home/kkusuman/software/myroot/bin/ld:libgcc.map: file format not
recognized; treating as linker script
/home/kkusuman/software/myroot/bin/ld:libgcc.map:1: syntax error
collect2: ld returned 1 exit status
make[5]: *** [libgcc_s.so] Error 1
make[5]: Leaving directory
`/home/kkusuman/software/compileHere/gcc-4.4-20081107/sparc-sun-solaris2.8/sparcv9/libgcc'
make[4]: *** [multi-do] Error 1
make[4]: Leaving directory
`/home/kkusuman/software/compileHere/gcc-4.4-20081107/sparc-sun-solaris2.8/libgcc'
make[3]: *** [all-multi] Error 2
make[3]: Leaving directory
`/home/kkusuman/software/compileHere/gcc-4.4-20081107/sparc-sun-solaris2.8/libgcc'
make[2]: *** [all-stage1-target-libgcc] Error 2
make[2]: Leaving directory
`/home/kkusuman/software/compileHere/gcc-4.4-20081107'
make[1]: *** [stage1-bubble] Error 2
make[1]: Leaving directory
`/home/kkusuman/software/compileHere/gcc-4.4-20081107'
make: *** [all] Error 2


I am attaching the latest make.log for the reference.

thanks
raju
-------------- next part --------------
A non-text attachment was scrubbed...
Name: make.log
Type: application/octet-stream
Size: 16532 bytes
Desc: not available
URL: <https://gcc.gnu.org/pipermail/gcc-help/attachments/20081113/401c8479/attachment.obj>


More information about the Gcc-help mailing list