gcc-4.3-20071109 Snapshot Build Failure - Fedora 7, i386, AMD 64x2

Tom Browder tom.browder@gmail.com
Tue Nov 13 16:10:00 GMT 2007


I tried to build the latest 4.3 snapshot but had the same failure as
reported previously for gcc-4.2.2.

The build fails here:

...
make[4]: Entering directory `/usr/local/src/gcc_build3/libiberty/testsuite'
make[4]: Nothing to be done for `all'.
make[4]: Leaving directory `/usr/local/src/gcc_build3/libiberty/testsuite'
/bin/sh: /usr/bin/true: Success
make[3]: *** [all] Error 1
make[3]: Leaving directory `/usr/local/src/gcc_build3/libiberty'
make[2]: *** [all-stage1-libiberty] Error 2
make[2]: Leaving directory `/usr/local/src/gcc_build3'
make[1]: *** [stage1-bubble] Error 2
make[1]: Leaving directory `/usr/local/src/gcc_build3'
make: *** [all] Error 2

Thanks.

-Tom

Tom Browder
Niceville, Florida
USA



More information about the Gcc-help mailing list