updating to revision 130069 fails at stage 1
Dominique Dhumieres
dominiq@lps.ens.fr
Sat Nov 10 12:31:00 GMT 2007
Updating from revision 130053 to 130069 (simple make) fails at stage 1 with:
...
gcc -g -fkeep-inline-functions -DIN_GCC -W -Wall -Wwrite-strings -Wstrict-prototypes -Wmissing-prototypes -Wold-style-definition -Wmissing-format-attribute -fno-common -DHAVE_CONFIG_H -o cc1-dummy c-lang.o stub-objc.o attribs.o c-errors.o c-lex.o c-pragma.o c-decl.o c-typeck.o c-convert.o c-aux-info.o c-common.o c-opts.o c-format.o c-semantics.o c-incpath.o cppdefault.o c-ppoutput.o c-cppbuiltin.o prefix.o c-objc-common.o c-dump.o c-pch.o c-parser.o darwin-c.o rs6000-c.o c-gimplify.o tree-mudflap.o c-pretty-print.o c-omp.o dummy-checksum.o \
main.o tree-browser.o libbackend.a ../libcpp/libcpp.a ../libdecnumber/libdecnumber.a ../libcpp/libcpp.a -lintl -L/sw/lib -liconv ../libiberty/libiberty.a ../libdecnumber/libdecnumber.a -L/sw/lib -lmpfr -lgmp
/usr/libexec/gcc/powerpc-apple-darwin8/4.0.1/ld: Undefined symbols:
_libintl_gettext
_libintl_bindtextdomain
_libintl_textdomain
_libintl_dgettext
collect2: ld returned 1 exit status
make[3]: *** [cc1-dummy] Error 1
make[2]: *** [all-stage1-gcc] Error 2
make[1]: *** [stage1-bubble] Error 2
make: *** [all] Error 2
Any idea of what's wrong?
TIA
Dominique
More information about the Gcc-help
mailing list