GCC build problem

Indranil Roy Burman indranil@cal.interrasystems.com
Fri May 5 13:36:00 GMT 2006


Hi,

I am facing some error at the time of build of gcc 4.0.2 at Solaris8.0. 
But I can able to build gcc 4.0.2
for Solaris 6 & 7.  Here is the screen shot.

ld: fatal: relocation error: R_SPARC_DISP32: file 
.libs/libstdc++.lax/libsupc++convenience.a/vec.o: symbol <unknown>: 
offset 0xfccd3399 is non-aligned
ld: fatal: relocation error: R_SPARC_DISP32: file 
.libs/libstdc++.lax/libsupc++convenience.a/vterminate.o: symbol 
<unknown>: offset 0xfccd33d5 is non-aligned
collect2: ld returned 1 exit status
make[3]: *** [libstdc++.la] Error 1
make[3]: Leaving directory 
`/net/ruby/ruby2/users/gcc_tmp/gcc-4.0.2_obj/sparc-sun-solaris2.8/libstdc++-v3/src' 

make[2]: *** [all-recursive] Error 1
make[2]: Leaving directory 
`/net/ruby/ruby2/users/gcc_tmp/gcc-4.0.2_obj/sparc-sun-solaris2.8/libstdc++-v3' 

make[1]: *** [all] Error 2
make[1]: Leaving directory 
`/net/ruby/ruby2/users/gcc_tmp/gcc-4.0.2_obj/sparc-sun-solaris2.8/libstdc++-v3' 

make: *** [all-target-libstdc++-v3] Error 2


Waiting for your valuable suggestion to solve this problem.

Thanks & Regards,
Indranil



More information about the Gcc-help mailing list