Trouble installing gcc 3.4.3

Super-User veapen@intersil.com
Tue Feb 8 21:54:00 GMT 2005


Hi
While installing gcc  3.4.3, during make these are the error messages
that I am getting:

make[3]: Leaving directory
`/array1/apps1/blr_cad/tarballs/gcc-3.4.3/gcc'
/array1/apps1/blr_cad/tarballs/gcc-3.4.3/gcc/xgcc
-B/array1/apps1/blr_cad/tarballs/gcc-3.4.3/gcc/
-B/array1/apps1/blr_cad/sparc-sun-solaris2.8/bin/
-B/array1/apps1/blr_cad/sparc-sun-solaris2.8/lib/ -isystem
/array1/apps1/blr_cad/sparc-sun-solaris2.8/include -isystem
/array1/apps1/blr_cad/sparc-sun-solaris2.8/sys-include -O2  -DIN_GCC
-W -Wall -Wwrite-strings -Wstrict-prototypes -Wmissing-prototypes
-Wold-style-definition  -isystem ./include  -fPIC -g -DHAVE_GTHR_DEFAULT
-DIN_LIBGCC2 -D__GCC_FLOAT_NOT_NEEDED  -shared -nodefaultlibs
-Wl,-h,libgcc_s.so.1 -Wl,-z,text -Wl,-z,defs -Wl,-M,libgcc/./libgcc.map
-o libgcc_s.so.1.tmp   libgcc/./_muldi3.o libgcc/./_negdi2.o
libgcc/./_lshrdi3.o libgcc/./_ashldi3.o libgcc/./_ashrdi3.o
libgcc/./_cmpdi2.o libgcc/./_ucmpdi2.o libgcc/./_floatdidf.o
libgcc/./_floatdisf.o libgcc/./_fixunsdfsi.o libgcc/./_fixunssfsi.o
libgcc/./_fixunsdfdi.o libgcc/./_fixdfdi.o libgcc/./_fixunssfdi.o
libgcc/./_fixsfdi.o libgcc/./_fixxfdi.o libgcc/./_fixunsxfdi.o
libgcc/./_floatdixf.o libgcc/./_fixunsxfsi.o libgcc/./_fixtfdi.o
libgcc/./_fixunstfdi.o libgcc/./_floatditf.o libgcc/./_clear_cache.o
libgcc/./_enable_execute_stack.o libgcc/./_trampoline.o
libgcc/./__main.o libgcc/./_absvsi2.o libgcc/./_absvdi2.o
libgcc/./_addvsi3.o libgcc/./_addvdi3.o libgcc/./_subvsi3.o
libgcc/./_subvdi3.o libgcc/./_mulvsi3.o libgcc/./_mulvdi3.o
libgcc/./_negvsi2.o libgcc/./_negvdi2.o libgcc/./_ctors.o
libgcc/./_ffssi2.o libgcc/./_ffsdi2.o libgcc/./_clz.o libgcc/./_clzsi2.o
libgcc/./_clzdi2.o libgcc/./_ctzsi2.o libgcc/./_ctzdi2.o
libgcc/./_popcount_tab.o libgcc/./_popcountsi2.o libgcc/./_popcountdi2.o
libgcc/./_paritysi2.o libgcc/./_paritydi2.o libgcc/./_divdi3.o
libgcc/./_moddi3.o libgcc/./_udivdi3.o libgcc/./_umoddi3.o
libgcc/./_udiv_w_sdiv.o libgcc/./_udivmoddi4.o  libgcc/./unwind-dw2.o
libgcc/./unwind-dw2-fde.o libgcc/./unwind-sjlj.o libgcc/./gthr-gnat.o
libgcc/./unwind-c.o -lc && rm -f libgcc_s.so && if [ -f libgcc_s.so.1 ];
then mv -f libgcc_s.so.1 libgcc_s.so.1.`basename `; else true; fi && mv
libgcc_s.so.1.tmp libgcc_s.so.1 && ln -s libgcc_s.so.1 libgcc_s.so
/array1/apps1/blr_cad/sparc-sun-solaris2.8/bin/ld:libgcc/./libgcc.map:
file format not recognized; treating as linker script
/array1/apps1/blr_cad/sparc-sun-solaris2.8/bin/ld:libgcc/./libgcc.map:1:
parse error
collect2: ld returned 1 exit status
make[2]: *** [libgcc_s.so] Error 1
make[2]: Leaving directory
`/array1/apps1/blr_cad/tarballs/gcc-3.4.3/gcc'
make[1]: *** [stmp-multilib] Error 2
make[1]: Leaving directory
`/array1/apps1/blr_cad/tarballs/gcc-3.4.3/gcc'
make: *** [all-gcc] Error 2


I am installing on sunsolaris  sparc  machine.
> uname -a
SunOS desh 5.8 Generic_108528-29 sun4u sparc SUNW,Sun-Fire-280R

Any help would be really appreciated.

Thanking you
Divya



More information about the Gcc-help mailing list