Errors while compiling gcj: c++filt not found

Jens Lisner lisner@informatik.uni-essen.de
Fri Sep 24 10:10:00 GMT 2004


-----BEGIN PGP SIGNED MESSAGE-----
Hash: SHA1

Hi!

I tried to compile the gcj on MAC OS X 10.3.5 with the Apple version of
the gcc 3.4 compiler.

This is what I got:

../gcc-3.4.2/configure --prefix=/usr/local/gcj --enable-threads=posix
- --enable-shared --disable-checking --enable-languages=c,c++,java


make or make bootstrap (same result)

...

/local/gcj/powerpc-apple-darwin7.5.0/bin/
- -B/usr/local/gcj/powerpc-apple-darwin7.5.0/lib/ -isystem
/usr/local/gcj/powerpc-apple-darwin7.5.0/include -isystem
/usr/local/gcj/powerpc-apple-darwin7.5.0/sys-include -O2  -DIN_GCC    -W
- -Wall -Wwrite-strings -Wstrict-prototypes -Wmissing-prototypes
- -Wold-style-definition  -isystem ./include  -mlong-double-128 -g
- -DHAVE_GTHR_DEFAULT -DIN_LIBGCC2 -D__GCC_FLOAT_NOT_NEEDED  -I. -I.
- -I../../gcc-3.4.2/gcc -I../../gcc-3.4.2/gcc/.
- -I../../gcc-3.4.2/gcc/../include -I../intl  -E -xassembler-with-cpp -; \
} | awk -f ../../gcc-3.4.2/gcc/mkmap-symver.awk  > libgcc/./tmp-libgcc.map
mv 'libgcc/./tmp-libgcc.map' libgcc/./libgcc.map
/Users/lisner/src/gcc_build_dir/gcc/xgcc
- -B/Users/lisner/src/gcc_build_dir/gcc/
- -B/usr/local/gcj/powerpc-apple-darwin7.5.0/bin/
- -B/usr/local/gcj/powerpc-apple-darwin7.5.0/lib/ -isystem
/usr/local/gcj/powerpc-apple-darwin7.5.0/include -isystem
/usr/local/gcj/powerpc-apple-darwin7.5.0/sys-include -O2  -DIN_GCC    -W
- -Wall -Wwrite-strings -Wstrict-prototypes -Wmissing-prototypes
- -Wold-style-definition  -isystem ./include  -mlong-double-128 -g
- -DHAVE_GTHR_DEFAULT -DIN_LIBGCC2 -D__GCC_FLOAT_NOT_NEEDED  -dynamiclib
- -nodefaultlibs -Wl,-install_name,/usr/local/gcj/lib/libgcc_s.1.0.dylib
- -Wl,-flat_namespace -o libgcc_s.1.0.dylib -compatibility_version 1
- -current_version 1.0   libgcc/./_muldi3.o libgcc/./_negdi2.o
libgcc/./_lshrdi3.o libgcc/./_ashldi3.o libgcc/./_ashrdi3.o
libgcc/./_cmpdi2.o libgcc/./_ucmpdi2.o libgcc/./_floatdidf.o
libgcc/./_floatdisf.o libgcc/./_fixunsdfsi.o libgcc/./_fixunssfsi.o
libgcc/./_fixunsdfdi.o libgcc/./_fixdfdi.o libgcc/./_fixunssfdi.o
libgcc/./_fixsfdi.o libgcc/./_fixxfdi.o libgcc/./_fixunsxfdi.o
libgcc/./_floatdixf.o libgcc/./_fixunsxfsi.o libgcc/./_fixtfdi.o
libgcc/./_fixunstfdi.o libgcc/./_floatditf.o libgcc/./_clear_cache.o
libgcc/./_enable_execute_stack.o libgcc/./_trampoline.o
libgcc/./__main.o libgcc/./_absvsi2.o libgcc/./_absvdi2.o
libgcc/./_addvsi3.o libgcc/./_addvdi3.o libgcc/./_subvsi3.o
libgcc/./_subvdi3.o libgcc/./_mulvsi3.o libgcc/./_mulvdi3.o
libgcc/./_negvsi2.o libgcc/./_negvdi2.o libgcc/./_ctors.o
libgcc/./_ffssi2.o libgcc/./_ffsdi2.o libgcc/./_clz.o libgcc/./_clzsi2.o
libgcc/./_clzdi2.o libgcc/./_ctzsi2.o libgcc/./_ctzdi2.o
libgcc/./_popcount_tab.o libgcc/./_popcountsi2.o libgcc/./_popcountdi2.o
libgcc/./_paritysi2.o libgcc/./_paritydi2.o libgcc/./_divdi3.o
libgcc/./_moddi3.o libgcc/./_udivdi3.o libgcc/./_umoddi3.o
libgcc/./_udiv_w_sdiv.o libgcc/./_udivmoddi4.o libgcc/./darwin-tramp.o
libgcc/./darwin-ldouble.o  libgcc/./unwind-dw2.o
libgcc/./unwind-dw2-fde-darwin.o libgcc/./unwind-sjlj.o
libgcc/./unwind-c.o -lc && rm -f libgcc_s.dylib && ln -s
libgcc_s.1.0.dylib libgcc_s.dylib
xgcc: installation problem, cannot exec `c++filt': No such file or directory
make[2]: *** [libgcc_s.dylib] Error 1
make[1]: *** [libgcc.a] Error 2
make: *** [all-gcc] Error 2

Does anybody knows how to fix this?

Thanks,
Jens

- --
Jens Chr. Lisner
University of Duisburg-Essen
FB05/ICB
lisner@informatik.uni-essen.de
Schuetzenbahn 70  D-45127 Essen          question = ( to ) ? be : ! be;
phone: ++49 +201 183-3186                         -- Wm. Shakespeare
fax:   ++49 +201 183-933186

-----BEGIN PGP SIGNATURE-----
Version: GnuPG v1.2.2 (Darwin)
Comment: Using GnuPG with Thunderbird - http://enigmail.mozdev.org

iD8DBQFBU/KFM71g6eO/KKwRAinuAJ0Uyu4SG6g5y7rn0WbeZrh74ZF5FwCaA629
oYFOs2rCVkpaQdHPgok//HU=
=H0RE
-----END PGP SIGNATURE-----



More information about the Gcc-help mailing list