install of gcc-3.1 fails on sparc64

konny gcc-help@signor.com
Thu Jul 4 07:15:00 GMT 2002


Really would like some insight on this. Have browsed the list but did 
not find and answer.

installation always fails on "make" see below:

# ../configure --prefix=/opt/FSFgcc-3.1  -with-as=/usr/ccs/bin/as 
--with-ld=/usr/ccs/bin/ld

FULL CONF FIGURE COMMAND:
#!/bin/sh
# This file was generated automatically by configure.  Do not edit.
# This directory was configured as follows:
../configure --with-gcc-version-trigger=/opt/src/gcc-3.1/gcc/version.c 
--host=sparc-sun-solaris2.8 --prefix=/opt/FSFgcc-3.1 
--with-as=/usr/ccs/bin/as --with-ld=/usr/ccs/bin/ld --norecursion
# using "mh-frag"

make
output when failed:
make [4]: Nothing to be done for `all'.
make[4]: Leaving directory `/opt/src/gcc-3.1/objdir/gcc/intl'
make[3]: Leaving directory `/opt/src/gcc-3.1/objdir/gcc'
/opt/src/gcc-3.1/objdir/gcc/xgcc -B/opt/src/gcc-3.1/objdir/gcc/ 
-B/opt/FSFgcc-3.1/sparc-sun-solaris2.8/bin/ 
-B/opt/FSFgcc-3.1/sparc-sun-solaris2.8/lib/ -isystem 
/opt/FSFgcc-3.1/sparc-sun-solaris2.8/include -O2  -DIN_GCC    -W -Wall 
-Wwrite-strings -Wstrict-prototypes -Wmissing-prototypes -isystem 
./include  -fPIC -g -DHAVE_GTHR_DEFAULT -DIN_LIBGCC2 
-D__GCC_FLOAT_NOT_NEEDED  -shared -nodefaultlibs -Wl,-h,libgcc_s.so.1 
-Wl,-z,text -Wl,-z,defs -Wl,-M,libgcc/sparcv9/libgcc.map -o 
sparcv9/libgcc_s.so.1  -m64  libgcc/sparcv9/_muldi3.o 
libgcc/sparcv9/_negdi2.o libgcc/sparcv9/_lshrdi3.o 
libgcc/sparcv9/_ashldi3.o libgcc/sparcv9/_ashrdi3.o 
libgcc/sparcv9/_ffsdi2.o libgcc/sparcv9/_clz.o libgcc/sparcv9/_cmpdi2.o 
libgcc/sparcv9/_ucmpdi2.o libgcc/sparcv9/_floatdidf.o 
libgcc/sparcv9/_floatdisf.o libgcc/sparcv9/_fixunsdfsi.o 
libgcc/sparcv9/_fixunssfsi.o libgcc/sparcv9/_fixunsdfdi.o 
libgcc/sparcv9/_fixdfdi.o libgcc/sparcv9/_fixunssfdi.o 
libgcc/sparcv9/_fixsfdi.o libgcc/sparcv9/_fixxfdi.o 
libgcc/sparcv9/_fixunsxfdi.o libgcc/sparcv9/_floatdixf.o 
libgcc/sparcv9/_fixunsxfsi.o libgcc/sparcv9/_fixtfdi.o 
libgcc/sparcv9/_fixunstfdi.o libgcc/sparcv9/_floatditf.o 
libgcc/sparcv9/_clear_cache.o libgcc/sparcv9/_trampoline.o 
libgcc/sparcv9/__main.o libgcc/sparcv9/_exit.o libgcc/sparcv9/_absvsi2.o 
libgcc/sparcv9/_absvdi2.o libgcc/sparcv9/_addvsi3.o 
libgcc/sparcv9/_addvdi3.o libgcc/sparcv9/_subvsi3.o 
libgcc/sparcv9/_subvdi3.o libgcc/sparcv9/_mulvsi3.o 
libgcc/sparcv9/_mulvdi3.o libgcc/sparcv9/_negvsi2.o 
libgcc/sparcv9/_negvdi2.o libgcc/sparcv9/_ctors.o 
libgcc/sparcv9/_divdi3.o libgcc/sparcv9/_moddi3.o 
libgcc/sparcv9/_udivdi3.o libgcc/sparcv9/_umoddi3.o 
libgcc/sparcv9/_udiv_w_sdiv.o libgcc/sparcv9/_udivmoddi4.o  
libgcc/sparcv9/unwind-dw2.o libgcc/sparcv9/unwind-dw2-fde.o 
libgcc/sparcv9/unwind-sjlj.o -lc && rm -f libgcc_s_sparcv9.so && ln -s 
sparcv9/libgcc_s.so.1 libgcc_s_sparcv9.so
ld: fatal: file /usr/lib/sparcv9/values-Xa.o: open failed: No such file 
or directory
ld: fatal: File processing errors. No output written to 
sparcv9/libgcc_s.so.1
collect2: ld returned 1 exit status
make[2]: *** [sparcv9/libgcc_s_sparcv9.so] Error 1
make[2]: Leaving directory `/opt/src/gcc-3.1/objdir/gcc'
make[1]: *** [stmp-multilib] Error 2
make[1]: Leaving directory `/opt/src/gcc-3.1/objdir/gcc'
make: *** [all-gcc] Error 2

CAn compile if multilib disabled but obviously do not get the 64bit 
compiler (which is want I'm after)

thank you in advance.
Konny



More information about the Gcc-help mailing list