GCC build failure
Unmesh joshi
unmesh_joshi@hotmail.com
Wed Feb 6 04:49:00 GMT 2002
Hi I again tried installing cygwin-1.3.9 and again downloaded latest source
for GCC-3.0.3 but still getting following error.
c:/gcc/bin/gcc -DIN_GCC -g -W -Wall -Wwrite-strings -Wstrict-prototypes
-Wm
issing-prototypes -Wtraditional -pedantic -Wno-long-long -DHAVE_CONFIG_H
-DCY
GWIN_CROSS_DIR=\"./i686-pc-cygwin\" -I. -I. -I../../gcc-3.0.3/gcc
-I../../gcc-3.
0.3/gcc/. -I../../gcc-3.0.3/gcc/config -I../../gcc-3.0.3/gcc/../include -c
../..
/gcc-3.0.3/gcc/c-parse.c
In file included from tm.h:9,
from ../../gcc-3.0.3/gcc/config/i386/xm-i386.h:39,
from config.h:5,
from c-parse.y:35:
insn-flags.h:55: parse error before '&&' token
In file included from config.h:12,
from c-parse.y:35:
insn-flags.h:55: parse error before '&&' token
make[2]: *** [c-parse.o] Error 1
make[2]: Leaving directory `/cygdrive/c/gccobj/gcc'
make[1]: *** [stage1_build] Error 2
make[1]: Leaving directory `/cygdrive/c/gccobj/gcc'
make: *** [bootstrap] Error 2
_________________________________________________________________
Join the worldÂs largest e-mail service with MSN Hotmail.
http://www.hotmail.com
More information about the Gcc-help
mailing list