Error building GCC 3.0.4 on RedHat 7.2
spela vintar
vintar@dfki.de
Tue Apr 16 22:40:00 GMT 2002
Dear helpers,
I'm trying to install gcc 3.0.4 on my RH7.2 box. After successful
configure, make bootstrap exits after issuing the following messages
(see below). It might be a trivial thing, I kindly ask for
beginner-friendly help.
Cheers,
Spela
/usr/lib/gcc-lib/i386-redhat-linux/objdir/i686-pc-linux-gnu/libstdc++-v3/include/bits/std_cwchar.h:127:
`fgetwc'
not declared
/usr/lib/gcc-lib/i386-redhat-linux/objdir/i686-pc-linux-gnu/libstdc++-v3/include/bits/std_cwchar.h:128:
`fgetws'
not declared
/usr/lib/gcc-lib/i386-redhat-linux/objdir/i686-pc-linux-gnu/libstdc++-v3/include/bits/std_cwchar.h:129:
`fputwc'
not declared
/usr/lib/gcc-lib/i386-redhat-linux/objdir/i686-pc-linux-gnu/libstdc++-v3/include/bits/std_cwchar.h:130:
`fputws'
not declared
/usr/lib/gcc-lib/i386-redhat-linux/objdir/i686-pc-linux-gnu/libstdc++-v3/include/bits/std_cwchar.h:131:
`fwide'
not declared
/usr/lib/gcc-lib/i386-redhat-linux/objdir/i686-pc-linux-gnu/libstdc++-v3/include/bits/std_cwchar.h:132:
`fwprintf'
not declared
/usr/lib/gcc-lib/i386-redhat-linux/objdir/i686-pc-linux-gnu/libstdc++-v3/include/bits/std_cwchar.h:133:
`fwscanf'
not declared
/usr/lib/gcc-lib/i386-redhat-linux/objdir/i686-pc-linux-gnu/libstdc++-v3/include/bits/std_cwchar.h:134:
`getwc'
not declared
/usr/lib/gcc-lib/i386-redhat-linux/objdir/i686-pc-linux-gnu/libstdc++-v3/include/bits/std_cwchar.h:135:
`getwchar'
not declared
/usr/lib/gcc-lib/i386-redhat-linux/objdir/i686-pc-linux-gnu/libstdc++-v3/include/bits/std_cwchar.h:140:
`putwc'
not declared
/usr/lib/gcc-lib/i386-redhat-linux/objdir/i686-pc-linux-gnu/libstdc++-v3/include/bits/std_cwchar.h:141:
`putwchar'
not declared
/usr/lib/gcc-lib/i386-redhat-linux/objdir/i686-pc-linux-gnu/libstdc++-v3/include/bits/std_cwchar.h:142:
`swprintf'
not declared
/usr/lib/gcc-lib/i386-redhat-linux/objdir/i686-pc-linux-gnu/libstdc++-v3/include/bits/std_cwchar.h:143:
`swscanf'
not declared
/usr/lib/gcc-lib/i386-redhat-linux/objdir/i686-pc-linux-gnu/libstdc++-v3/include/bits/std_cwchar.h:144:
`ungetwc'
not declared
/usr/lib/gcc-lib/i386-redhat-linux/objdir/i686-pc-linux-gnu/libstdc++-v3/include/bits/std_cwchar.h:145:
`vfwprintf'
not declared
/usr/lib/gcc-lib/i386-redhat-linux/objdir/i686-pc-linux-gnu/libstdc++-v3/include/bits/std_cwchar.h:146:
`vfwscanf'
not declared
/usr/lib/gcc-lib/i386-redhat-linux/objdir/i686-pc-linux-gnu/libstdc++-v3/include/bits/std_cwchar.h:147:
`vswprintf'
not declared
/usr/lib/gcc-lib/i386-redhat-linux/objdir/i686-pc-linux-gnu/libstdc++-v3/include/bits/std_cwchar.h:148:
`vswscanf'
not declared
/usr/lib/gcc-lib/i386-redhat-linux/objdir/i686-pc-linux-gnu/libstdc++-v3/include/bits/std_cwchar.h:149:
`vwprintf'
not declared
/usr/lib/gcc-lib/i386-redhat-linux/objdir/i686-pc-linux-gnu/libstdc++-v3/include/bits/std_cwchar.h:150:
`vwscanf'
not declared
/usr/lib/gcc-lib/i386-redhat-linux/objdir/i686-pc-linux-gnu/libstdc++-v3/include/bits/std_cwchar.h:157:
`wcsftime'
not declared
/usr/lib/gcc-lib/i386-redhat-linux/objdir/i686-pc-linux-gnu/libstdc++-v3/include/bits/std_cwchar.h:175:
`wprintf'
not declared
/usr/lib/gcc-lib/i386-redhat-linux/objdir/i686-pc-linux-gnu/libstdc++-v3/include/bits/std_cwchar.h:176:
`wscanf'
not declared
make[4]: *** [basic_file.lo] Error 1
make[4]: Leaving directory
`/usr/lib/gcc-lib/i386-redhat-linux/objdir/i686-pc-linux-gnu/libstdc++-v3/src'
make[3]: *** [all-recursive] Error 1
make[3]: Leaving directory
`/usr/lib/gcc-lib/i386-redhat-linux/objdir/i686-pc-linux-gnu/libstdc++-v3'
make[2]: *** [all-recursive-am] Error 2
make[2]: Leaving directory
`/usr/lib/gcc-lib/i386-redhat-linux/objdir/i686-pc-linux-gnu/libstdc++-v3'
make[1]: *** [all-target-libstdc++-v3] Error 2
make[1]: Leaving directory `/usr/lib/gcc-lib/i386-redhat-linux/objdir'
make: *** [bootstrap] Error 2
More information about the Gcc-help
mailing list