Make bootstrap problem on Solaris 2.8

Edgar Villanueva EVillanueva@dynamicsoft.com
Thu Feb 1 09:41:00 GMT 2001


I am  having the following problem with libffi.

Anybody know what this is?

I think I am not setting something in my environment correctly but not sure.



/tmp/gccwork/build/gcc/xgcc -B/tmp/gccwork/build/gcc/
-B/home/evillanueva/gccwork/sparc-sun-solaris2.8/bin/
-B/home/evillanueva/gccwork/sparc-sun-solaris2.8/lib/ -isystem
/home/evillanueva/gccwork/sparc-sun-solaris2.8/include -DHAVE_CONFIG_H -I.
-I../../../gcc/libffi -I. -I../../../gcc/libffi/include -Iinclude
-I../../../gcc/libffi/src   -fexceptions -g -O2 -c
../../../gcc/libffi/src/ffitest.c
/bin/sh ./libtool --mode=link /tmp/gccwork/build/gcc/xgcc
-B/tmp/gccwork/build/gcc/
-B/home/evillanueva/gccwork/sparc-sun-solaris2.8/bin/
-B/home/evillanueva/gccwork/sparc-sun-solaris2.8/lib/ -isystem
/home/evillanueva/gccwork/sparc-sun-solaris2.8/include -fexceptions -g -O2
-o ffitest  ffitest.o libffi.la 
/tmp/gccwork/build/gcc/xgcc -B/tmp/gccwork/build/gcc/
-B/home/evillanueva/gccwork/sparc-sun-solaris2.8/bin/
-B/home/evillanueva/gccwork/sparc-sun-solaris2.8/lib/ -isystem
/home/evillanueva/gccwork/sparc-sun-solaris2.8/include -fexceptions -g -O2
-o .libs/ffitest ffitest.o  ./.libs/libffi.so
-R/home/evillanueva/gccwork/lib
/usr/local/bin/gnu-ld: ./.libs/libffi.so: __iob: invalid version 6 (max 0)
./.libs/libffi.so: could not read symbols: Bad value
collect2: ld returned 1 exit status
make[4]: *** [ffitest] Error 1
make[4]: Leaving directory `/tmp/gccwork/build/sparc-sun-solaris2.8/libffi'
make[3]: *** [all-recursive] Error 1
make[3]: Leaving directory `/tmp/gccwork/build/sparc-sun-solaris2.8/libffi'
make[2]: *** [all-recursive-am] Error 2
make[2]: Leaving directory `/tmp/gccwork/build/sparc-sun-solaris2.8/libffi'
make[1]: *** [all-target-libffi] Error 2
make[1]: Leaving directory `/tmp/gccwork/build'
make: *** [bootstrap] Error 2
bash$ 



More information about the Gcc-help mailing list