stage1 seg fault on i586-ncr-sysv4.3.03

paulf@metaip.checkpoint.com paulf@metaip.checkpoint.com
Tue Jan 25 18:46:00 GMT 2000


Using binutils 2.9.1, --with-gnu-as and --with-gnu-ld, 2.95.2 fails make
bootstrap, just after gcc/stage1 is populated.  This machine does not have a
decent debugger (gdb won't even build on it) so I can't tell you much more
than "it crashed".  I have only changed gcc/auto-host.h to #define
HAVE_LIMITS_H to 1 (necessary for it to even get this far).

I have seen (unanswered) postings from other people having this exact
problem on other architectures..

./gencheck > tmp-check.h
Segmentation Fault - core dumped
make[2]: *** [s-check] Error 139
make[2]: Leaving directory `/a1/paulf/software/gcc-2.95.2/objdir/gcc'
make[1]: *** [bootstrap] Error 2
make[1]: Leaving directory `/a1/paulf/software/gcc-2.95.2/objdir/gcc'
make: *** [bootstrap] Error 2


More information about the Gcc-help mailing list