[Bug bootstrap/82091] [5 only] Build failure on macOS 10.13 with Xcode 9

juergen.reuter at desy dot de gcc-bugzilla@gcc.gnu.org
Sun Nov 19 00:57:00 GMT 2017


https://gcc.gnu.org/bugzilla/show_bug.cgi?id=82091

--- Comment #5 from Jürgen Reuter <juergen.reuter at desy dot de> ---
I can see this also for trunk r253992: 
In file included from ../../gcc/unique-ptr-tests.cc:23:
In file included from ../../gcc/../include/unique-ptr.h:77:
In file included from
/Applications/Xcode.app/Contents/Developer/Toolchains/XcodeDefault.xctoolchain/usr/include/c++/v1/memory:639:
/Applications/Xcode.app/Contents/Developer/Toolchains/XcodeDefault.xctoolchain/usr/include/c++/v1/stdexcept:250:4:
error: no member named 'fancy_abort' in namespace 'std::__1';
      did you mean simply 'fancy_abort'?
          _VSTD::abort();
          ^~~~~~~
/Applications/Xcode.app/Contents/Developer/Toolchains/XcodeDefault.xctoolchain/usr/include/c++/v1/__config:392:15:
note: expanded from macro '_VSTD'
#define _VSTD std::_LIBCPP_NAMESPACE
              ^
../../gcc/system.h:725:13: note: 'fancy_abort' declared here
extern void fancy_abort (const char *, int, const char *)
            ^
In file included from ../../gcc/unique-ptr-tests.cc:23:
In file included from ../../gcc/../include/unique-ptr.h:77:
In file included from
/Applications/Xcode.app/Contents/Developer/Toolchains/XcodeDefault.xctoolchain/usr/include/c++/v1/memory:639:
/Applications/Xcode.app/Contents/Developer/Toolchains/XcodeDefault.xctoolchain/usr/include/c++/v1/stdexcept:261:5:
error: no member named 'fancy_abort' in namespace 'std::__1';
      did you mean simply 'fancy_abort'?
    _VSTD::abort();
    ^~~~~~~
/Applications/Xcode.app/Contents/Developer/Toolchains/XcodeDefault.xctoolchain/usr/include/c++/v1/__config:392:15:
note: expanded from macro '_VSTD'
#define _VSTD std::_LIBCPP_NAMESPACE
              ^
../../gcc/system.h:725:13: note: 'fancy_abort' declared here
extern void fancy_abort (const char *, int, const char *)
            ^
In file included from ../../gcc/unique-ptr-tests.cc:23:
In file included from ../../gcc/../include/unique-ptr.h:77:
In file included from
/Applications/Xcode.app/Contents/Developer/Toolchains/XcodeDefault.xctoolchain/usr/include/c++/v1/memory:639:
/Applications/Xcode.app/Contents/Developer/Toolchains/XcodeDefault.xctoolchain/usr/include/c++/v1/stdexcept:272:5:
error: no member named 'fancy_abort' in namespace 'std::__1';
      did you mean simply 'fancy_abort'?
    _VSTD::abort();
    ^~~~~~~
/Applications/Xcode.app/Contents/Developer/Toolchains/XcodeDefault.xctoolchain/usr/include/c++/v1/__config:392:15:
note: expanded from macro '_VSTD'
#define _VSTD std::_LIBCPP_NAMESPACE
              ^
../../gcc/system.h:725:13: note: 'fancy_abort' declared here
extern void fancy_abort (const char *, int, const char *)
            ^
In file included from ../../gcc/unique-ptr-tests.cc:23:
In file included from ../../gcc/../include/unique-ptr.h:77:
/Applications/Xcode.app/Contents/Developer/Toolchains/XcodeDefault.xctoolchain/usr/include/c++/v1/memory:3698:5:
error: no member named 'fancy_abort' in namespace 'std::__1'; did
      you mean simply 'fancy_abort'?
    _VSTD::abort();
    ^~~~~~~
/Applications/Xcode.app/Contents/Developer/Toolchains/XcodeDefault.xctoolchain/usr/include/c++/v1/__config:392:15:
note: expanded from macro '_VSTD'
#define _VSTD std::_LIBCPP_NAMESPACE
              ^
../../gcc/system.h:725:13: note: 'fancy_abort' declared here
extern void fancy_abort (const char *, int, const char *)
            ^
5 warnings and 10 errors generated.
make[3]: *** [unique-ptr-tests.o] Error 1
make[2]: *** [all-stage1-gcc] Error 2
make[1]: *** [stage1-bubble] Error 2


More information about the Gcc-bugs mailing list