[Bug bootstrap/65763] New: tm.h: No such file or directory

d.v.a at ngs dot ru gcc-bugzilla@gcc.gnu.org
Tue Apr 14 15:22:00 GMT 2015


https://gcc.gnu.org/bugzilla/show_bug.cgi?id=65763

            Bug ID: 65763
           Summary: tm.h: No such file or directory
           Product: gcc
           Version: 5.0
            Status: UNCONFIRMED
          Severity: normal
          Priority: P3
         Component: bootstrap
          Assignee: unassigned at gcc dot gnu.org
          Reporter: d.v.a at ngs dot ru
              Host: x86_64-linux
            Target: x86_64-linux
             Build: x86_64-linux

gcc-5.1.0-RC-20150412.tar.bz2 build error:

...
libtool: compile: 
/home/vdyachenko/usr/misc/gcc/gcc-5.1.0-RC-20150412/host-x86_64-unknown-linux-gnu/gcc/xg++
-B/home/vdyachenko/usr/misc/gcc/gcc-5.1.0-RC-20150412/host-x86_64-unknown-linux-gnu/gcc/
-nostdinc++ -nostdinc++
-I/home/vdyachenko/usr/misc/gcc/gcc-5.1.0-RC-20150412/x86_64-unknown-linux-gnu/libstdc++-v3/include/x86_64-unknown-linux-gnu
-I/home/vdyachenko/usr/misc/gcc/gcc-5.1.0-RC-20150412/x86_64-unknown-linux-gnu/libstdc++-v3/include
-I/home/vdyachenko/usr/misc/gcc/gcc-5.1.0-RC-20150412/libstdc++-v3/libsupc++
-I/home/vdyachenko/usr/misc/gcc/gcc-5.1.0-RC-20150412/libstdc++-v3/include/backward
-I/home/vdyachenko/usr/misc/gcc/gcc-5.1.0-RC-20150412/libstdc++-v3/testsuite/util
-L/home/vdyachenko/usr/misc/gcc/gcc-5.1.0-RC-20150412/x86_64-unknown-linux-gnu/libstdc++-v3/src
-L/home/vdyachenko/usr/misc/gcc/gcc-5.1.0-RC-20150412/x86_64-unknown-linux-gnu/libstdc++-v3/src/.libs
-L/home/vdyachenko/usr/misc/gcc/gcc-5.1.0-RC-20150412/x86_64-unknown-linux-gnu/libstdc++-v3/libsupc++/.libs
-B/home/vdyachenko/usr/misc/gcc/gcc-5.1.0-RC-20150412/x86_64-unknown-linux-gnu/libstdc++-v3/src/.libs
-B/home/vdyachenko/usr/misc/gcc/gcc-5.1.0-RC-20150412/x86_64-unknown-linux-gnu/libstdc++-v3/libsupc++/.libs
-B/opt/gcc-5.1/x86_64-unknown-linux-gnu/bin/
-B/opt/gcc-5.1/x86_64-unknown-linux-gnu/lib/ -isystem
/opt/gcc-5.1/x86_64-unknown-linux-gnu/include -isystem
/opt/gcc-5.1/x86_64-unknown-linux-gnu/sys-include -DHAVE_CONFIG_H -I.
-I../.././libcc1 -I ../.././libcc1/../include -I ../.././libcc1/../libgcc -I
../host-x86_64-unknown-linux-gnu/gcc -I../.././libcc1/../gcc -I
../.././libcc1/../gcc/c -I ../.././libcc1/../gcc/c-family -I
../.././libcc1/../libcpp/include
-I/home/vdyachenko/usr/misc/gcc/gcc-5.1.0-RC-20150412/host-x86_64-unknown-linux-gnu/gmp
-I/home/vdyachenko/usr/misc/gcc/gcc-5.1.0-RC-20150412/gmp
-I/home/vdyachenko/usr/misc/gcc/gcc-5.1.0-RC-20150412/host-x86_64-unknown-linux-gnu/mpfr/src
-I/home/vdyachenko/usr/misc/gcc/gcc-5.1.0-RC-20150412/mpfr/src
-I/home/vdyachenko/usr/misc/gcc/gcc-5.1.0-RC-20150412/mpc/src -W -Wall
-fvisibility=hidden -g -O2 -D_GNU_SOURCE -MT plugin.lo -MD -MP -MF
.deps/plugin.Tpo -c ../.././libcc1/plugin.cc  -fPIC -DPIC -o .libs/plugin.o

In file included from ../.././libcc1/plugin.cc:34:0:
../.././libcc1/../gcc/gcc-plugin.h:31:16: fatal error: tm.h: No such file or
directory
compilation terminated.
make[3]: *** [plugin.lo] Error 1
make[3]: Leaving directory
`/home/vdyachenko/usr/misc/gcc/gcc-5.1.0-RC-20150412/host-x86_64-unknown-linux-gnu/libcc1'
make[2]: *** [all] Error 2
make[2]: Leaving directory
`/home/vdyachenko/usr/misc/gcc/gcc-5.1.0-RC-20150412/host-x86_64-unknown-linux-gnu/libcc1'
make[1]: *** [all-libcc1] Error 2
make[1]: Leaving directory
`/home/vdyachenko/usr/misc/gcc/gcc-5.1.0-RC-20150412'
make: *** [all] Error 2


$ uname -a; cat /etc/*-release
Linux m247.meranetworks.ru 2.6.18-308.1.1.el5 #1 SMP Wed Mar 7 04:16:51 EST
2012 x86_64 x86_64 x86_64 GNU/Linux
CentOS release 5.8 (Final)

$ ./configure --prefix=/opt/gcc-5.1 --enable-languages=c,c++ --enable-lto

What information is required additionally?



More information about the Gcc-bugs mailing list