[Bug bootstrap/41348] Bootstrap fails with --with-arch=i686
aanisimov at inbox dot ru
gcc-bugzilla@gcc.gnu.org
Sat Sep 19 12:32:00 GMT 2009
------- Comment #2 from aanisimov at inbox dot ru 2009-09-19 12:32 -------
> that one is expected and doesn't fail the build. What's the output after that?
Indeed, I've messed up a bit last time. Rev. 151361 builds fine, but with rev.
151362 I get
Comparing stages 2 and 3
warning: gcc/cc1-checksum.o differs
warning: gcc/cc1plus-checksum.o differs
Bootstrap comparison failure!
gcc/cfgloopmanip.o differs
libiberty/pic/make-temp-file.o differs
libiberty/make-temp-file.o differs
make[2]: *** [compare] Error 1
make[2]: Leaving directory `/home/artem/testing/gcc-build'
make[1]: *** [stage3-bubble] Error 2
make[1]: Leaving directory `/home/artem/testing/gcc-build'
make: *** [all] Error 2
--
http://gcc.gnu.org/bugzilla/show_bug.cgi?id=41348
More information about the Gcc-bugs
mailing list