[Bug bootstrap/40617] [4.5 Regression] Revision 149170 breaks bootstrap

hjl dot tools at gmail dot com gcc-bugzilla@gcc.gnu.org
Thu Jul 2 14:36:00 GMT 2009



------- Comment #7 from hjl dot tools at gmail dot com  2009-07-02 14:36 -------
(In reply to comment #6)
> Ok, I see it with stage3 only :(
> 
> build/genmodes > tmp-modes.c
> /bin/sh: line 1: 16996 Segmentation fault      build/genmodes > tmp-modes.c
> make[3]: *** [s-modes] Error 139
> make[3]: *** Waiting for unfinished jobs....
> rm fsf-funding.pod gcov.pod gfdl.pod cpp.pod gcc.pod
> make[3]: Leaving directory `/abuild/rguenther/obj-32/gcc'
> make[2]: *** [all-stage3-gcc] Error 2
> make[2]: Leaving directory `/abuild/rguenther/obj-32'
> make[1]: *** [stage3-bubble] Error 2
> make[1]: Leaving directory `/abuild/rguenther/obj-32'
> make: *** [all] Error 2
> 

Configuring gcc with

../src-trunk/configure --enable-clocale=gnu --with-system-zlib --enable-shared
--with-demangler-in-ld

may see it in stage2.


-- 


http://gcc.gnu.org/bugzilla/show_bug.cgi?id=40617



More information about the Gcc-bugs mailing list