[Bug bootstrap/42400] objc build fails
rainer at emrich-ebersheim dot de
gcc-bugzilla@gcc.gnu.org
Thu Dec 17 11:22:00 GMT 2009
------- Comment #1 from rainer at emrich-ebersheim dot de 2009-12-17 11:21 -------
(In reply to comment #0)
> most likely the changes of 155302 are the cause.
>
> ../../gcc-4-5-libwork/gcc/objc/objc-act.c: In function Âobjc_substitute_declÂ:
> ../../gcc-4-5-libwork/gcc/objc/objc-act.c:3118:14: error: incompatible type for
> argument 3 of Âbuild_indirect_refÂ
> ../../gcc-4-5-libwork/gcc/c-common.h:465:13: note: expected Âref_operator but
> argument is of type Âconst char *Â
> ../../gcc-4-5-libwork/gcc/objc/objc-act.c: In function Âbuild_ivar_referenceÂ:
> ../../gcc-4-5-libwork/gcc/objc/objc-act.c:6826:14: error: incompatible type for
> argument 3 of Âbuild_indirect_refÂ
> ../../gcc-4-5-libwork/gcc/c-common.h:465:13: note: expected Âref_operator but
> argument is of type Âconst char *Â
> ../../gcc-4-5-libwork/gcc/objc/objc-act.c: In function Âget_super_receiverÂ:
> ../../gcc-4-5-libwork/gcc/objc/objc-act.c:8844:10: error: incompatible type for
> argument 3 of Âbuild_indirect_refÂ
> ../../gcc-4-5-libwork/gcc/c-common.h:465:13: note: expected Âref_operator but
> argument is of type Âconst char *Â
> cc1: warnings being treated as errors
> ../../gcc-4-5-libwork/gcc/objc/objc-act.c: In function Âbuild_ivar_referenceÂ:
> ../../gcc-4-5-libwork/gcc/objc/objc-act.c:6827:1: error: control reaches end of
> non-void function
> make[3]: *** [objcp/objcp-act.o] Error 1
> make[2]: *** [all-stage2-gcc] Error 2
> make[1]: *** [stage2-bubble] Error 2
> make: *** [bootstrap] Error 2
>
Confirmed for x86_64-unknown-linux-gnu.
It's caused by r155302 see http://gcc.gnu.org/ml/gcc-cvs/2009-12/msg00446.html
and PR40885.
--
rainer at emrich-ebersheim dot de changed:
What |Removed |Added
----------------------------------------------------------------------------
CC| |rainer at emrich-ebersheim
| |dot de
http://gcc.gnu.org/bugzilla/show_bug.cgi?id=42400
More information about the Gcc-bugs
mailing list