[Bug bootstrap/23927] New: [4.1 Regression] --enable-intermodule is broken
pinskia at gcc dot gnu dot org
gcc-bugzilla@gcc.gnu.org
Sat Sep 17 03:43:00 GMT 2005
--enable-intermodule is trying to building libbackend.o on stage1.
Error message:
gcc: cannot specify -o with -c or -S and multiple compilations
make[4]: *** [libbackend.o] Error 1
make[4]: Leaving directory `/home/pinskia/src/onetest/gcc/objdir/gcc'
make[3]: *** [extra] Error 2
make[3]: Leaving directory `/home/pinskia/src/onetest/gcc/objdir/gcc'
make[2]: *** [stmp-multilib] Error 2
make[2]: Leaving directory `/home/pinskia/src/onetest/gcc/objdir/gcc'
make[1]: *** [stage1_build] Error 2
make[1]: Leaving directory `/home/pinskia/src/onetest/gcc/objdir/gcc'
make: *** [bootstrap] Error 2
gcc_build: error: Could not bootstrap the compiler
--
Summary: [4.1 Regression] --enable-intermodule is broken
Product: gcc
Version: 4.1.0
Status: UNCONFIRMED
Keywords: build
Severity: normal
Priority: P2
Component: bootstrap
AssignedTo: unassigned at gcc dot gnu dot org
ReportedBy: pinskia at gcc dot gnu dot org
CC: gcc-bugs at gcc dot gnu dot org
http://gcc.gnu.org/bugzilla/show_bug.cgi?id=23927
More information about the Gcc-bugs
mailing list