[Bug bootstrap/25009] New: Bootstrap: Failure to build doc/gcc.info
mckelvey at maskull dot com
gcc-bugzilla@gcc.gnu.org
Thu Nov 24 01:48:00 GMT 2005
Today's CVS (pardon, SVN):
gmake[3]: Entering directory `/usr/home/mckelvey/software/gcc-obj/gcc'
gmake[3]: Nothing to be done for `all'.
gmake[3]: Leaving directory `/usr/home/mckelvey/software/gcc-obj/gcc'
if [ xinfo = xinfo ]; then \
makeinfo --split-size=5000000 --no-split -I . -I ../../gcc/gcc/doc \
-I ../../gcc/gcc/doc/include -o doc/gcc.info
../../gcc/gcc/doc/gcc.texi; \
fi
../../gcc/gcc/doc/invoke.texi:1057: @include
`@value{srcdir}/../libiberty/at-file.texi': No such file or directory.
makeinfo: Removing output file `doc/gcc.info' due to errors; use --force to
preserve.
gmake[2]: *** [doc/gcc.info] Error 2
gmake[2]: Leaving directory `/usr/home/mckelvey/software/gcc-obj/gcc'
gmake[1]: *** [stage1_build] Error 2
gmake[1]: Leaving directory `/usr/home/mckelvey/software/gcc-obj/gcc'
gmake: *** [bootstrap] Error 2
alpha1:PD>uname -a
Linux alpha1 2.4.9-40 #1 Mon Sep 23 08:14:02 EDT 2002 alpha unknown
alpha1:PD>gcc -v
Using built-in specs.
Target: alphaev56-unknown-linux-gnu
Configured with: ../gcc/configure --verbose --enable-languages=c++
--disable-nls
Thread model: posix
gcc version 4.1.0 20050924 (experimental)
alpha1:PD>alias CONFIGURECVS
alias CONFIGURECVS='../gcc/configure --verbose --enable-languages=c++
--disable-nls >clog 2>&1 &'
alpha1:PD>alias BUILD
alias BUILD='nice gmake CFLAGS='\'''\'' BOOT_CFLAGS='\'''\''
LIBCFLAGS='\''-g'\'' LIBCXXFLAGS='\''-g'\'' bootstrap >log 2>&1 &'
--
Summary: Bootstrap: Failure to build doc/gcc.info
Product: gcc
Version: 4.2.0
Status: UNCONFIRMED
Severity: normal
Priority: P3
Component: bootstrap
AssignedTo: unassigned at gcc dot gnu dot org
ReportedBy: mckelvey at maskull dot com
GCC build triplet: alphaev56-unknown-linux-gnu
GCC host triplet: alphaev56-unknown-linux-gnu
GCC target triplet: alphaev56-unknown-linux-gnu
http://gcc.gnu.org/bugzilla/show_bug.cgi?id=25009
More information about the Gcc-bugs
mailing list