[Bug target/19745] New: meta: cris-elf gcc, g++, objc testsuite failures as of "Tue Feb 1 22:03:59 UTC 2005"
hp at gcc dot gnu dot org
gcc-bugzilla@gcc.gnu.org
Wed Feb 2 01:03:00 GMT 2005
This is a meta-bug for failing test-cases as of LAST_UPDATED
"Tue Feb 1 22:03:59 UTC 2005" for cris-axis-elf (excluding
fortran and libstdc++ failures), each failure to be further
separately dealt with with a specific PC, this PR to depend
on it; dependencies added to this PR for existing specific PR:s.
To repeat, use simtest-howto.html but (because there's no
dejagnu release with it and it doesn't seem to be checked in
to the official dejagnu CVS yet) use the baseboard file in
<URL:http://lists.gnu.org/archive/html/dejagnu/2005-01/txt0KyZPJtvL1.txt>
saved as cris-sim.exp, RUNTESTFLAGS=--target_board=cris-sim.
The failures covered by this PR are:
FAIL: gcc.c-torture/execute/20001130-1.c compilation, -O0
FAIL: gcc.c-torture/execute/20010605-1.c compilation, -O0
FAIL: gcc.c-torture/execute/20030313-1.c compilation, -O0
FAIL: gcc.c-torture/execute/20050106-1.c compilation, -O0
FAIL: gcc.c-torture/execute/920501-8.c execution, -O0
FAIL: gcc.c-torture/execute/920501-8.c execution, -O1
FAIL: gcc.c-torture/execute/920501-8.c execution, -O2
FAIL: gcc.c-torture/execute/920501-8.c execution, -O3 -fomit-frame-pointer
FAIL: gcc.c-torture/execute/920501-8.c execution, -O3 -g
FAIL: gcc.c-torture/execute/920501-8.c execution, -Os
FAIL: gcc.c-torture/execute/920721-3.c compilation, -O0
FAIL: gcc.c-torture/execute/941202-1.c compilation, -O0
FAIL: gcc.c-torture/execute/941202-1.c compilation, -O1
FAIL: gcc.c-torture/execute/960116-1.c compilation, -O0
FAIL: gcc.c-torture/execute/980526-2.c compilation, -O0
FAIL: gcc.c-torture/execute/990208-1.c compilation, -O0
FAIL: gcc.c-torture/execute/cvt-1.c compilation, -O0
FAIL: gcc.c-torture/execute/simd-4.c compilation, -O0
WARNING: gcc.dg/20010912-1.c compilation failed to produce executable
FAIL: gcc.dg/20020430-1.c (test for excess errors)
FAIL: gcc.dg/20021018-1.c (test for excess errors)
WARNING: gcc.dg/20021018-1.c compilation failed to produce executable
FAIL: gcc.dg/20021023-1.c (test for excess errors)
FAIL: gcc.dg/20021029-1.c (test for excess errors)
ERROR: gcc.dg/20021029-1.c: error executing dg-final: couldn't open
"20021029-1.s": no such file or directory
WARNING: gcc.dg/20030225-1.c compilation failed to produce executable
FAIL: gcc.dg/20030702-1.c (test for excess errors)
FAIL: gcc.dg/20030708-1.c (test for excess errors)
FAIL: gcc.dg/20040311-2.c (test for excess errors)
FAIL: gcc.dg/Wpadded.c (test for warnings, line 10)
FAIL: gcc.dg/bitfld-3.c execution test
FAIL: gcc.dg/intmax_t-1.c (test for excess errors)
FAIL: gcc.dg/setjmp-1.c spurious clobbered warning (test for bogus messages,
line 16)
FAIL: gcc.dg/trampoline-1.c execution test
XPASS: gcc.dg/tree-ssa/20040204-1.c scan-tree-dump-times link_error 0
FAIL: gcc.dg/tree-ssa/loop-1.c scan-assembler-times foo 5
FAIL: gcc.dg/weak/typeof-2.c scan-assembler baz3.*baz3.*baz3.*baz3.*baz3.*baz3
FAIL: g++.dg/abi/bitfield12.C (test for warnings, line 3)
FAIL: g++.dg/abi/vbase10.C (test for warnings, line 13)
FAIL: g++.dg/ext/visibility/noPLT.C (test for excess errors)
ERROR: g++.dg/ext/visibility/noPLT.C: error executing dg-final: couldn't open
"noPLT.s": no such file or directory
FAIL: g++.dg/opt/vt1.C (test for excess errors)
ERROR: g++.dg/opt/vt1.C: error executing dg-final: couldn't open "vt1.s": no
such file or directory
FAIL: g++.old-deja/g++.jason/thunk2.C (test for excess errors)
WARNING: g++.old-deja/g++.jason/thunk2.C compilation failed to produce
executable
WARNING: g++.old-deja/g++.mike/p10769a.C compilation failed to produce
executable
FAIL: objc/execute/IMP.m compilation, -O0
FAIL: objc/execute/class-1.m compilation, -O0
FAIL: objc/execute/class-10.m compilation, -O0
FAIL: objc/execute/class-11.m compilation, -O0
FAIL: objc/execute/class-12.m compilation, -O0
FAIL: objc/execute/class-13.m compilation, -O0
FAIL: objc/execute/class-14.m compilation, -O0
FAIL: objc/execute/class-2.m compilation, -O0
FAIL: objc/execute/class-3.m compilation, -O0
FAIL: objc/execute/class-4.m compilation, -O0
FAIL: objc/execute/class-5.m compilation, -O0
FAIL: objc/execute/class-6.m compilation, -O0
FAIL: objc/execute/class-7.m compilation, -O0
FAIL: objc/execute/class-8.m compilation, -O0
FAIL: objc/execute/class-9.m compilation, -O0
FAIL: objc/execute/nested-2.m compilation, -O0
FAIL: objc/execute/object_is_class.m compilation, -O0
FAIL: objc/execute/object_is_meta_class.m compilation, -O0
EOF
--
Summary: meta: cris-elf gcc, g++, objc testsuite failures as of
"Tue Feb 1 22:03:59 UTC 2005"
Product: gcc
Version: 4.0.0
Status: UNCONFIRMED
Keywords: meta-bug
Severity: normal
Priority: P2
Component: target
AssignedTo: hp at gcc dot gnu dot org
ReportedBy: hp at gcc dot gnu dot org
CC: gcc-bugs at gcc dot gnu dot org
GCC host triplet: i686-pc-linux-gnu
GCC target triplet: cris-axis-elf
http://gcc.gnu.org/bugzilla/show_bug.cgi?id=19745
More information about the Gcc-bugs
mailing list